ACCESSION: MSBNK-Fac_Eng_Univ_Tokyo-JP006203
RECORD_TITLE: 2-BUTOXYETHANOL; CI-B; MS
DATE: 2016.01.19 (Created 2008.10.21, modified 2011.05.06)
AUTHORS: HASHIMOTO K, KYOTO COLLEGE OF PHARMACY
LICENSE: CC BY-NC-SA

CH$NAME: 2-BUTOXYETHANOL
CH$NAME: ETHYLENE GLYCOL MONOBUTYL ETHER
CH$COMPOUND_CLASS: N/A
CH$FORMULA: C6H14O2
CH$EXACT_MASS: 118.09938
CH$SMILES: CCCCOCCO
CH$IUPAC: InChI=1S/C6H14O2/c1-2-3-5-8-6-4-7/h7H,2-6H2,1H3
CH$LINK: INCHIKEY POAOYUHQDCAZBD-UHFFFAOYSA-N
CH$LINK: COMPTOX DTXSID1024097

AC$INSTRUMENT: HITACHI M-80
AC$INSTRUMENT_TYPE: CI-B
AC$MASS_SPECTROMETRY: MS_TYPE MS
AC$MASS_SPECTROMETRY: ION_MODE POSITIVE
AC$MASS_SPECTROMETRY: IONIZATION_ENERGY 100 eV
AC$MASS_SPECTROMETRY: REAGENT_GAS ISOBUTANE

PK$SPLASH: splash10-014i-0900000000-cce152f1d2586d1d2b15
PK$NUM_PEAK: 12
PK$PEAK: m/z int. rel.int.
  76 4.28 43
  85 1.51 15
  87 7.02 70
  100 5.71 57
  101 3.69 37
  103 3.2 32
  117 4.69 47
  118 2.44 24
  119 99.99 999
  120 18.81 188
  121 1.67 17
  237 3.87 39