ACCESSION: MSBNK-Fac_Eng_Univ_Tokyo-JP006876
RECORD_TITLE: DECANE; EI-B; MS
DATE: 2016.01.19 (Created 2008.10.21, modified 2011.05.06)
AUTHORS: TAJIMA S, GUNMA COLLEGE OF TECHNOLOGY
LICENSE: CC BY-NC-SA

CH$NAME: DECANE
CH$COMPOUND_CLASS: N/A
CH$FORMULA: C10H22
CH$EXACT_MASS: 142.17215
CH$SMILES: CCCCCCCCCC
CH$IUPAC: InChI=1S/C10H22/c1-3-5-7-9-10-8-6-4-2/h3-10H2,1-2H3
CH$LINK: INCHIKEY DIOQZVSQGTUSAI-UHFFFAOYSA-N
CH$LINK: COMPTOX DTXSID6024913

AC$INSTRUMENT: HITACHI M-80B
AC$INSTRUMENT_TYPE: EI-B
AC$MASS_SPECTROMETRY: MS_TYPE MS
AC$MASS_SPECTROMETRY: ION_MODE POSITIVE
AC$MASS_SPECTROMETRY: IONIZATION_ENERGY 70 eV

MS$FOCUSED_ION: ION_TYPE [M]+*

PK$SPLASH: splash10-052f-9000000000-eaff23c4d9aac623bf75
PK$NUM_PEAK: 26
PK$PEAK: m/z int. rel.int.
  27 18.53 185
  28 2.5 25
  29 30.17 302
  39 9.85 99
  41 43.49 435
  42 13.73 137
  43 99.99 999
  44 2.55 26
  53 1.99 20
  54 1.44 14
  55 13.08 131
  56 17.88 179
  57 83.01 830
  58 3.98 40
  69 2.87 29
  70 9.03 90
  71 32.6 326
  72 1.67 17
  84 5.88 59
  85 22.36 224
  86 1.37 14
  98 3.23 32
  99 4.24 42
  112 1.03 10
  113 2.16 22
  142 5.27 53