ACCESSION: MSBNK-Fac_Eng_Univ_Tokyo-JP007280
RECORD_TITLE: (2S,3S)-3-METHYLBUTAN-1,2,4-TRIOL 1,2-ISOPROPYLIDENE ACETAL; EI-B; MS
DATE: 2016.01.19 (Created 2008.10.21, modified 2011.05.06)
AUTHORS: ITO S, DEPT. OF CHEM., TOHOKU UNIV.
LICENSE: CC BY-NC-SA

CH$NAME: (2S,3S)-3-METHYLBUTAN-1,2,4-TRIOL 1,2-ISOPROPYLIDENE ACETAL
CH$COMPOUND_CLASS: N/A
CH$FORMULA: C8H16O3
CH$EXACT_MASS: 160.10994
CH$SMILES: OCC([H])(C)C([H])(C1)OC(C)(C)O1
CH$IUPAC: InChI=1S/C8H16O3/c1-6(4-9)7-5-10-8(2,3)11-7/h6-7,9H,4-5H2,1-3H3/t6-,7+/m0/s1
CH$LINK: INCHIKEY ZEXONBYTDOABDB-NKWVEPMBSA-N

AC$INSTRUMENT: HITACHI M-52
AC$INSTRUMENT_TYPE: EI-B
AC$MASS_SPECTROMETRY: MS_TYPE MS
AC$MASS_SPECTROMETRY: ION_MODE POSITIVE
AC$MASS_SPECTROMETRY: IONIZATION_ENERGY 14 eV

MS$FOCUSED_ION: ION_TYPE [M]+*

PK$SPLASH: splash10-000i-9200000000-7d5c9772a8f9b538380b
PK$NUM_PEAK: 35
PK$PEAK: m/z int. rel.int.
  41 2 20
  42 2.9 29
  43 20.1 201
  54 0.47 5
  55 1.8 18
  56 5.8 58
  57 2.6 26
  58 2.5 25
  59 16.6 166
  61 4.4 44
  67 2.6 26
  68 0.93 9
  69 8.8 88
  70 1.8 18
  71 3.8 38
  72 2.16 22
  73 4.7 47
  82 2.9 29
  83 1.8 18
  84 0.82 8
  85 99.99 999
  86 2.9 29
  87 4.4 44
  99 0.23 2
  101 13.7 137
  102 4.1 41
  103 2.6 26
  115 0.2 2
  124 2 20
  129 12 120
  143 3.5 35
  145 8.41 84
  146 7.6 76
  159 1.2 12
  161 1.5 15