ACCESSION: MSBNK-Fac_Eng_Univ_Tokyo-JP007426
RECORD_TITLE: 2,3-DIMETHYLBENZENAMINE; CI-B; MS
DATE: 2016.01.19 (Created 2008.10.21, modified 2011.05.06)
AUTHORS: YAMAMOTO M, DEP. CHEMISTRY, FAC. SCIENCE, NARA WOMEN'S UNIV.
LICENSE: CC BY-NC-SA

CH$NAME: 2,3-DIMETHYLBENZENAMINE
CH$NAME: 2,3-XYLIDINE
CH$COMPOUND_CLASS: N/A
CH$FORMULA: C8H11N
CH$EXACT_MASS: 121.08915
CH$SMILES: Cc(c1)c(C)c(N)cc1
CH$IUPAC: InChI=1S/C8H11N/c1-6-4-3-5-8(9)7(6)2/h3-5H,9H2,1-2H3
CH$LINK: INCHIKEY VVAKEQGKZNKUSU-UHFFFAOYSA-N
CH$LINK: COMPTOX DTXSID3026304

AC$INSTRUMENT: HITACHI M-80
AC$INSTRUMENT_TYPE: CI-B
AC$MASS_SPECTROMETRY: MS_TYPE MS
AC$MASS_SPECTROMETRY: ION_MODE POSITIVE
AC$MASS_SPECTROMETRY: IONIZATION_ENERGY 70 eV
AC$MASS_SPECTROMETRY: REAGENT_GAS ISOBUTANE

PK$SPLASH: splash10-00di-0900000000-4386b86b32102f03fc5e
PK$NUM_PEAK: 15
PK$PEAK: m/z int. rel.int.
  77 1.05 11
  78 1.57 16
  79 1.42 14
  80 0.96 10
  91 1.24 12
  93 0.77 8
  94 0.88 9
  103 0.58 6
  104 0.56 6
  106 6.16 62
  107 0.74 7
  120 3.03 30
  121 29.58 296
  122 99.99 999
  123 8.51 85