ACCESSION: MSBNK-Fac_Eng_Univ_Tokyo-JP007429
RECORD_TITLE: 2,6-DIMETHYLBENZENAMINE; CI-B; MS
DATE: 2016.01.19 (Created 2008.10.21, modified 2011.05.06)
AUTHORS: YAMAMOTO M, DEP. CHEMISTRY, FAC. SCIENCE, NARA WOMEN'S UNIV.
LICENSE: CC BY-NC-SA

CH$NAME: 2,6-DIMETHYLBENZENAMINE
CH$NAME: 2,6-XYLIDINE
CH$COMPOUND_CLASS: N/A
CH$FORMULA: C8H11N
CH$EXACT_MASS: 121.08915
CH$SMILES: Cc(c1)c(N)c(C)cc1
CH$IUPAC: InChI=1S/C8H11N/c1-6-4-3-5-7(2)8(6)9/h3-5H,9H2,1-2H3
CH$LINK: INCHIKEY UFFBMTHBGFGIHF-UHFFFAOYSA-N
CH$LINK: COMPTOX DTXSID8026307

AC$INSTRUMENT: HITACHI M-80
AC$INSTRUMENT_TYPE: CI-B
AC$MASS_SPECTROMETRY: MS_TYPE MS
AC$MASS_SPECTROMETRY: ION_MODE POSITIVE
AC$MASS_SPECTROMETRY: IONIZATION_ENERGY 70 eV
AC$MASS_SPECTROMETRY: REAGENT_GAS ISOBUTANE

PK$SPLASH: splash10-00di-0900000000-60300dd43db5cd2a3ce8
PK$NUM_PEAK: 8
PK$PEAK: m/z int. rel.int.
  91 0.54 5
  106 2.8 28
  120 3.74 37
  121 30.44 304
  122 99.99 999
  123 9.33 93
  162 1.38 14
  164 2.52 25