ACCESSION: MSBNK-Fac_Eng_Univ_Tokyo-JP007431
RECORD_TITLE: 1-METHOXY-3-METHYLBENZENE; CI-B; MS
DATE: 2016.01.19 (Created 2008.10.21, modified 2011.05.06)
AUTHORS: YAMAMOTO M, DEP. CHEMISTRY, FAC. SCIENCE, NARA WOMEN'S UNIV.
LICENSE: CC BY-NC-SA

CH$NAME: 1-METHOXY-3-METHYLBENZENE
CH$NAME: META-METHYLANISOLE
CH$COMPOUND_CLASS: N/A
CH$FORMULA: C8H10O
CH$EXACT_MASS: 122.07316
CH$SMILES: COc(c1)cc(C)cc1
CH$IUPAC: InChI=1S/C8H10O/c1-7-4-3-5-8(6-7)9-2/h3-6H,1-2H3
CH$LINK: CAS 100-84-5
CH$LINK: INCHIKEY OSIGJGFTADMDOB-UHFFFAOYSA-N
CH$LINK: COMPTOX DTXSID2051500

AC$INSTRUMENT: HITACHI M-80
AC$INSTRUMENT_TYPE: CI-B
AC$MASS_SPECTROMETRY: MS_TYPE MS
AC$MASS_SPECTROMETRY: ION_MODE POSITIVE
AC$MASS_SPECTROMETRY: IONIZATION_ENERGY 70 eV
AC$MASS_SPECTROMETRY: REAGENT_GAS ISOBUTANE

PK$SPLASH: splash10-00di-0900000000-3f03721b7476cb6b8824
PK$NUM_PEAK: 14
PK$PEAK: m/z int. rel.int.
  71 1.34 13
  79 0.67 7
  91 1.7 17
  92 0.89 9
  107 0.98 10
  121 2.6 26
  122 32.34 323
  123 99.99 999
  124 8.95 90
  125 0.67 7
  135 1.4 14
  163 5.9 59
  164 0.78 8
  165 2.26 23