ACCESSION: MSBNK-Fac_Eng_Univ_Tokyo-JP007438
RECORD_TITLE: 2-(2-METHOXYETHOXY)ETHANOL; CI-B; MS
DATE: 2016.01.19 (Created 2008.10.21, modified 2011.05.06)
AUTHORS: YAMAMOTO M, DEP. CHEMISTRY, FAC. SCIENCE, NARA WOMEN'S UNIV.
LICENSE: CC BY-NC-SA

CH$NAME: 2-(2-METHOXYETHOXY)ETHANOL
CH$NAME: METHYL CARBITOL
CH$COMPOUND_CLASS: N/A
CH$FORMULA: C5H12O3
CH$EXACT_MASS: 120.07864
CH$SMILES: COCCOCCO
CH$IUPAC: InChI=1S/C5H12O3/c1-7-4-5-8-3-2-6/h6H,2-5H2,1H3
CH$LINK: CAS 111-77-3
CH$LINK: INCHIKEY SBASXUCJHJRPEV-UHFFFAOYSA-N
CH$LINK: COMPTOX DTXSID3025049

AC$INSTRUMENT: HITACHI M-80
AC$INSTRUMENT_TYPE: CI-B
AC$MASS_SPECTROMETRY: MS_TYPE MS
AC$MASS_SPECTROMETRY: ION_MODE POSITIVE
AC$MASS_SPECTROMETRY: IONIZATION_ENERGY 70 eV
AC$MASS_SPECTROMETRY: REAGENT_GAS ISOBUTANE

PK$SPLASH: splash10-00di-0900000000-ed698b1474b442359064
PK$NUM_PEAK: 7
PK$PEAK: m/z int. rel.int.
  103 1.19 12
  119 0.69 7
  121 99.99 999
  122 6.51 65
  123 1.03 10
  147 0.5 5
  241 1.07 11