ACCESSION: MSBNK-Fac_Eng_Univ_Tokyo-JP007671
RECORD_TITLE: CARBON TETRACHLORIDE; EI-B; MS
DATE: 2016.01.19 (Created 2008.10.21, modified 2011.05.06)
AUTHORS: TAJIMA S, GUNMA COLLEGE OF TECHNOLOGY
LICENSE: CC BY-NC-SA

CH$NAME: CARBON TETRACHLORIDE
CH$COMPOUND_CLASS: N/A
CH$FORMULA: CCl4
CH$EXACT_MASS: 151.87541
CH$SMILES: ClC(Cl)(Cl)Cl
CH$IUPAC: InChI=1S/CCl4/c2-1(3,4)5
CH$LINK: CAS 56-23-5
CH$LINK: INCHIKEY VZGDMQKNWNREIO-UHFFFAOYSA-N
CH$LINK: COMPTOX DTXSID8020250

AC$INSTRUMENT: HITACHI RMU-7M
AC$INSTRUMENT_TYPE: EI-B
AC$MASS_SPECTROMETRY: MS_TYPE MS
AC$MASS_SPECTROMETRY: ION_MODE POSITIVE
AC$MASS_SPECTROMETRY: IONIZATION_ENERGY 70 eV

MS$FOCUSED_ION: ION_TYPE [M]+*

PK$SPLASH: splash10-014i-3900000000-388a28717a2eebbdd5b4
PK$NUM_PEAK: 13
PK$PEAK: m/z int. rel.int.
  12 1.76 18
  35 10.9 109
  37 3.29 33
  47 20.75 208
  49 7.05 71
  82 25.8 258
  83 3.04 30
  84 16.91 169
  86 2.4 24
  117 99.99 999
  119 94.47 945
  121 30.29 303
  123 3.21 32