ACCESSION: MSBNK-Fac_Eng_Univ_Tokyo-JP007682
RECORD_TITLE: 1,2,3,4-TETRAHYDRONAPHTHALENE; EI-B; MS
DATE: 2016.01.19 (Created 2008.10.21, modified 2011.05.06)
AUTHORS: TAJIMA S, GUNMA COLLEGE OF TECHNOLOGY
LICENSE: CC BY-NC-SA

CH$NAME: 1,2,3,4-TETRAHYDRONAPHTHALENE
CH$COMPOUND_CLASS: N/A
CH$FORMULA: C10H12
CH$EXACT_MASS: 132.09390
CH$SMILES: C(C2)Cc(c1)c(C2)ccc1
CH$IUPAC: InChI=1S/C10H12/c1-2-6-10-8-4-3-7-9(10)5-1/h1-2,5-6H,3-4,7-8H2
CH$LINK: CAS 119-64-2
CH$LINK: INCHIKEY CXWXQJXEFPUFDZ-UHFFFAOYSA-N
CH$LINK: COMPTOX DTXSID1026118

AC$INSTRUMENT: HITACHI RMU-7M
AC$INSTRUMENT_TYPE: EI-B
AC$MASS_SPECTROMETRY: MS_TYPE MS
AC$MASS_SPECTROMETRY: ION_MODE POSITIVE
AC$MASS_SPECTROMETRY: IONIZATION_ENERGY 70 eV

MS$FOCUSED_ION: ION_TYPE [M]+*

PK$SPLASH: splash10-0ue9-4900000000-75531cea62a238084a34
PK$NUM_PEAK: 35
PK$PEAK: m/z int. rel.int.
  27 3.24 32
  39 6.18 62
  41 1.86 19
  50 2.84 28
  51 8.73 87
  52 2.06 21
  53 2.45 25
  57 1.76 18
  57.5 2.75 28
  58 1.08 11
  63 5.1 51
  64 5.59 56
  64.5 1.18 12
  65 7.65 77
  76 1.57 16
  77 8.14 81
  78 11.67 117
  79 1.96 20
  89 2.55 26
  91 47.25 473
  92 3.82 38
  102 2.75 28
  103 8.82 88
  104 99.99 999
  105 9.61 96
  115 11.86 119
  116 5.39 54
  117 14.71 147
  127 3.82 38
  128 7.84 78
  129 5.88 59
  130 1.86 19
  131 12.94 129
  132 50.29 503
  133 5.59 56