ACCESSION: MSBNK-Fac_Eng_Univ_Tokyo-JP008173
RECORD_TITLE: N,N-DIMETHYLACETAMIDE; EI-B; MS
DATE: 2016.01.19 (Created 2008.10.21, modified 2011.05.06)
AUTHORS: NARA WOMEN'S UNIVERSITY
LICENSE: CC BY-NC-SA

CH$NAME: N,N-DIMETHYLACETAMIDE
CH$COMPOUND_CLASS: N/A
CH$FORMULA: C4H9NO
CH$EXACT_MASS: 87.06841
CH$SMILES: CN(C)C(C)=O
CH$IUPAC: InChI=1S/C4H9NO/c1-4(6)5(2)3/h1-3H3
CH$LINK: CAS 127-19-5
CH$LINK: INCHIKEY FXHOOIRPVKKKFG-UHFFFAOYSA-N
CH$LINK: COMPTOX DTXSID5020499

AC$INSTRUMENT: HITACHI M-80
AC$INSTRUMENT_TYPE: EI-B
AC$MASS_SPECTROMETRY: MS_TYPE MS
AC$MASS_SPECTROMETRY: ION_MODE POSITIVE
AC$MASS_SPECTROMETRY: IONIZATION_ENERGY 70 eV

MS$FOCUSED_ION: ION_TYPE [M]+*

PK$SPLASH: splash10-000f-9000000000-3e6188c24621731b28b2
PK$NUM_PEAK: 21
PK$PEAK: m/z int. rel.int.
  14 0.95 10
  15 9.21 92
  18 2.28 23
  27 0.9 9
  28 4.17 42
  29 1.08 11
  30 9.54 95
  31 1.31 13
  40 1 10
  41 1.76 18
  42 19.4 194
  43 39.73 397
  44 99.99 999
  45 26.3 263
  46 0.91 9
  56 1.59 16
  58 1.45 15
  72 21.82 218
  73 1.09 11
  87 88.47 885
  88 9 90