ACCESSION: MSBNK-Fac_Eng_Univ_Tokyo-JP008626
RECORD_TITLE: ACETALDEHYDE DIMETHYL ACETAL; EI-B; MS
DATE: 2016.01.19 (Created 2008.10.21, modified 2011.05.06)
AUTHORS: SODA AROMATIC CO., LTD.
LICENSE: CC BY-NC-SA

CH$NAME: ACETALDEHYDE DIMETHYL ACETAL
CH$COMPOUND_CLASS: N/A
CH$FORMULA: C4H10O2
CH$EXACT_MASS: 90.06808
CH$SMILES: COC(C)OC
CH$IUPAC: InChI=1S/C4H10O2/c1-4(5-2)6-3/h4H,1-3H3
CH$LINK: INCHIKEY SPEUIVXLLWOEMJ-UHFFFAOYSA-N
CH$LINK: COMPTOX DTXSID7027178

AC$INSTRUMENT: HITACHI M-80B
AC$INSTRUMENT_TYPE: EI-B
AC$MASS_SPECTROMETRY: MS_TYPE MS
AC$MASS_SPECTROMETRY: ION_MODE POSITIVE
AC$MASS_SPECTROMETRY: IONIZATION_ENERGY 70 eV

MS$FOCUSED_ION: ION_TYPE [M]+*

PK$SPLASH: splash10-0a6r-9000000000-888c99470f47c81f0c57
PK$NUM_PEAK: 18
PK$PEAK: m/z int. rel.int.
  14 1.26 13
  15 15.82 158
  26 1.96 20
  27 7.14 71
  29 32.02 320
  30 1.88 19
  31 36.42 364
  33 1.18 12
  41 1.55 16
  42 2.32 23
  43 25.2 252
  45 1.44 14
  47 11.07 111
  58 2.37 24
  59 99.99 999
  60 2.71 27
  75 34.44 344
  89 1.23 12