ACCESSION: MSBNK-Fac_Eng_Univ_Tokyo-JP009171
RECORD_TITLE: P-ALLYL ANISOLE; EI-B; MS
DATE: 2016.01.19 (Created 2008.10.21, modified 2011.05.06)
AUTHORS: SODA AROMATIC CO., LTD.
LICENSE: CC BY-NC-SA

CH$NAME: P-ALLYL ANISOLE
CH$COMPOUND_CLASS: N/A
CH$FORMULA: C10H12O
CH$EXACT_MASS: 148.08882
CH$SMILES: C=CCc(c1)ccc(OC)c1
CH$IUPAC: InChI=1S/C10H12O/c1-3-4-9-5-7-10(11-2)8-6-9/h3,5-8H,1,4H2,2H3
CH$LINK: INCHIKEY ZFMSMUAANRJZFM-UHFFFAOYSA-N
CH$LINK: COMPTOX DTXSID0020575

AC$INSTRUMENT: HITACHI M-80B
AC$INSTRUMENT_TYPE: EI-B
AC$MASS_SPECTROMETRY: MS_TYPE MS
AC$MASS_SPECTROMETRY: ION_MODE POSITIVE
AC$MASS_SPECTROMETRY: IONIZATION_ENERGY 70 eV

MS$FOCUSED_ION: ION_TYPE [M]+*

PK$SPLASH: splash10-0002-5900000000-926e28a4944e333f20a8
PK$NUM_PEAK: 50
PK$PEAK: m/z int. rel.int.
  15 6 60
  26 1.18 12
  27 7.13 71
  29 1.55 16
  38 2.05 21
  39 13.41 134
  41 3.75 38
  43 1.19 12
  50 5.67 57
  51 14.01 140
  52 5.95 60
  53 3.5 35
  55 5.14 51
  62 2.58 26
  63 6.96 70
  64 2.72 27
  65 6.32 63
  66 1.06 11
  74 1.93 19
  75 2.04 20
  76 2.23 22
  77 24.65 247
  78 17.68 177
  79 12.04 120
  89 4.22 42
  90 1.41 14
  91 19.59 196
  92 2.29 23
  93 1.25 13
  102 2.38 24
  103 12.21 122
  104 3.61 36
  105 21.61 216
  106 2.07 21
  107 1.96 20
  115 16.34 163
  116 7.15 72
  117 29.66 297
  118 2.83 28
  119 2.13 21
  121 36.25 363
  122 2.5 25
  131 2.68 27
  132 2.86 29
  133 21.65 217
  134 1.56 16
  146 1.61 16
  147 43.21 432
  148 99.99 999
  149 8.5 85