ACCESSION: MSBNK-Fac_Eng_Univ_Tokyo-JP011274
RECORD_TITLE: FLUORANTHENE; EI-B; MS
DATE: 2016.01.19 (Created 2008.10.21, modified 2011.05.06)
AUTHORS: TAJIMA S, GUNMA COLLEGE OF TECHNOLOGY
LICENSE: CC BY-NC-SA

CH$NAME: FLUORANTHENE
CH$COMPOUND_CLASS: N/A
CH$FORMULA: C16H10
CH$EXACT_MASS: 202.07825
CH$SMILES: c(c4)cc(c(c4)1)c(c3)c(c2cc3)c(ccc2)1
CH$IUPAC: InChI=1S/C16H10/c1-2-8-13-12(7-1)14-9-3-5-11-6-4-10-15(13)16(11)14/h1-10H
CH$LINK: INCHIKEY GVEPBJHOBDJJJI-UHFFFAOYSA-N
CH$LINK: COMPTOX DTXSID3024104

AC$INSTRUMENT: HITACHI M-80A
AC$INSTRUMENT_TYPE: EI-B
AC$MASS_SPECTROMETRY: MS_TYPE MS
AC$MASS_SPECTROMETRY: ION_MODE POSITIVE
AC$MASS_SPECTROMETRY: IONIZATION_ENERGY 70 eV

MS$FOCUSED_ION: ION_TYPE [M]+*

PK$SPLASH: splash10-0udi-0190000000-da5621de3cc73018691e
PK$NUM_PEAK: 20
PK$PEAK: m/z int. rel.int.
  63 1.02 10
  74 1.28 13
  75 1.52 15
  87 1.82 18
  88 3.33 33
  99 1.2 12
  100 4.76 48
  101 8.24 82
  102 1.4 14
  150 1.57 16
  174 2 20
  175 1.57 16
  176 1.82 18
  198 1.49 15
  199 2.46 25
  200 14.54 145
  201 11.38 114
  202 99.99 999
  203 18.2 182
  204 2.38 24