ACCESSION: MSBNK-Fac_Eng_Univ_Tokyo-JP011357
RECORD_TITLE: 1,1,1-TRIMETHYLDISILANE; EI-B; MS
DATE: 2016.01.19 (Created 2008.10.21, modified 2011.05.06)
AUTHORS: YAMAMOTO M, DEP. CHEMISTRY, FAC. SCIENCE, NARA WOMEN'S UNIV.
LICENSE: CC BY-NC-SA

CH$NAME: 1,1,1-TRIMETHYLDISILANE
CH$COMPOUND_CLASS: N/A
CH$FORMULA: C3H12Si2
CH$EXACT_MASS: 104.04775
CH$SMILES: C[Si](C)(C)[SiH3]
CH$IUPAC: InChI=1S/C3H12Si2/c1-5(2,3)4/h1-4H3
CH$LINK: INCHIKEY ZVGUNGATIFIZOL-UHFFFAOYSA-N
CH$LINK: COMPTOX DTXSID40275851

AC$INSTRUMENT: HITACHI RMU-6M
AC$INSTRUMENT_TYPE: EI-B
AC$MASS_SPECTROMETRY: MS_TYPE MS
AC$MASS_SPECTROMETRY: ION_MODE POSITIVE
AC$MASS_SPECTROMETRY: IONIZATION_ENERGY 70 eV

MS$FOCUSED_ION: ION_TYPE [M]+*

PK$SPLASH: splash10-00di-9200000000-06c6032e383f95cc6d69
PK$NUM_PEAK: 28
PK$PEAK: m/z int. rel.int.
  43 5.9 59
  44 1 10
  45 5.9 59
  59 2.9 29
  69 4.4 44
  70 1 10
  71 1 10
  72 1 10
  73 99.99 999
  74 8.8 88
  75 4 40
  81 1 10
  83 1 10
  84 1 10
  85 5.1 51
  86 2.2 22
  87 14 140
  88 2.2 22
  89 19.9 199
  90 2.2 22
  91 1 10
  99 1 10
  100 1 10
  101 2.9 29
  102 16.9 169
  103 15.4 154
  104 10.3 103
  105 2.2 22