ACCESSION: MSBNK-Fac_Eng_Univ_Tokyo-JP011634
RECORD_TITLE: (+)-CINCHONINE; EI-B; MS
DATE: 2016.01.19 (Created 2008.10.21, modified 2011.05.06)
AUTHORS: YAMAMOTO M, DEP. CHEMISTRY, FAC. SCIENCE, NARA WOMEN'S UNIV.
LICENSE: CC BY-NC-SA

CH$NAME: (+)-CINCHONINE
CH$COMPOUND_CLASS: N/A
CH$FORMULA: C19H22N2O
CH$EXACT_MASS: 294.17321
CH$SMILES: N/A
CH$IUPAC: N/A
CH$LINK: CAS 118-10-5
CH$LINK: NIKKAJI J2.475I

AC$INSTRUMENT: HITACHI M-2500
AC$INSTRUMENT_TYPE: EI-B
AC$MASS_SPECTROMETRY: MS_TYPE MS
AC$MASS_SPECTROMETRY: ION_MODE POSITIVE
AC$MASS_SPECTROMETRY: IONIZATION_ENERGY 70 eV

MS$FOCUSED_ION: ION_TYPE [M]+*

PK$SPLASH: splash10-000i-4930000000-bb5af2be4419c6f3255c
PK$NUM_PEAK: 87
PK$PEAK: m/z int. rel.int.
  27 1.65 17
  28 1.63 16
  29 2.08 21
  30 1.12 11
  39 2.37 24
  41 8.02 80
  42 9.49 95
  43 1.35 14
  44 2.16 22
  51 1.22 12
  53 4.15 42
  54 2.17 22
  55 10.01 100
  56 3.7 37
  65 1.1 11
  67 3.13 31
  68 2.06 21
  69 1.54 15
  70 1.42 14
  75 1.17 12
  77 4.16 42
  79 5.64 56
  80 2.67 27
  81 14.13 141
  82 6.94 69
  83 1.39 14
  91 1.14 11
  93 1.19 12
  94 2.58 26
  95 5.11 51
  96 1.39 14
  101 2.03 20
  102 1.7 17
  103 1.91 19
  105 1.03 10
  108 3.22 32
  109 1.78 18
  110 2.36 24
  111 1.53 15
  115 1.56 16
  122 2.22 22
  123 1.26 13
  124 3.91 39
  126 2.93 29
  128 3.87 39
  129 4.06 41
  130 10.05 101
  131 1.16 12
  134 1.12 11
  136 99.99 999
  137 11.54 115
  138 12.76 128
  139 2.2 22
  142 3.39 34
  143 9.34 93
  144 1.51 15
  152 1.14 11
  154 1.72 17
  156 3.16 32
  157 2.09 21
  158 5.05 51
  159 19.38 194
  160 2.38 24
  166 1.36 14
  167 2.34 23
  168 2.16 22
  169 1.48 15
  170 2.36 24
  171 1.91 19
  172 1.74 17
  182 1 10
  183 1.3 13
  184 2.69 27
  185 1.02 10
  210 1 10
  239 2.01 20
  253 7.47 75
  254 1.38 14
  265 1.33 13
  267 2.68 27
  277 2.03 20
  279 1.32 13
  293 2.7 27
  294 42.24 422
  295 10 100
  296 8.22 82
  297 1.74 17