ACCESSION: MSBNK-Fac_Eng_Univ_Tokyo-JP011765
RECORD_TITLE: 1,2,2,2-(TETRAMETHYL)-1,1-DI(1-NAPHTHYL)DISILANE; EI-B; MS
DATE: 2016.01.19 (Created 2008.10.21, modified 2011.05.06)
AUTHORS: FAC. TECHNOLOGY, HIROSHIMA UNIV.
LICENSE: CC BY-NC-SA

CH$NAME: 1,2,2,2-(TETRAMETHYL)-1,1-DI(1-NAPHTHYL)DISILANE
CH$COMPOUND_CLASS: N/A
CH$FORMULA: C24H26Si2
CH$EXACT_MASS: 370.15730
CH$SMILES: [Si](C)([Si](C)(C)C)(c(c3)c(c4)c(ccc4)cc3)c(c1)c(c2)c(ccc2)cc1
CH$IUPAC: InChI=1S/C24H26Si2/c1-25(2,3)26(4,23-17-9-13-19-11-5-7-15-21(19)23)24-18-10-14-20-12-6-8-16-22(20)24/h5-18H,1-4H3
CH$LINK: INCHIKEY GEYWEFDIDTUDMB-UHFFFAOYSA-N

AC$INSTRUMENT: SHIMADZU QP-1000
AC$INSTRUMENT_TYPE: EI-B
AC$MASS_SPECTROMETRY: MS_TYPE MS
AC$MASS_SPECTROMETRY: ION_MODE POSITIVE
AC$MASS_SPECTROMETRY: IONIZATION_ENERGY 70 eV

MS$FOCUSED_ION: ION_TYPE [M]+*

PK$SPLASH: splash10-00kb-2972000000-fb5bc3157ae493505baa
PK$NUM_PEAK: 61
PK$PEAK: m/z int. rel.int.
  43 15.2 152
  45 19.2 192
  46 1.3 13
  53 6.4 64
  55 1 10
  57 1.3 13
  59 2.4 24
  73 22.3 223
  77 1.6 16
  103 2.2 22
  105 1.3 13
  115 3 30
  129 8.5 85
  130 1.3 13
  131 1.7 17
  141 2.1 21
  142 1 10
  143 2.4 24
  145 2.9 29
  153 2.1 21
  154 4 40
  155 15.1 151
  156 2.6 26
  157 1.4 14
  167 22.9 229
  168 6.3 63
  169 71.3 713
  170 15.1 151
  171 4.4 44
  181 2.1 21
  182 1.3 13
  183 5.1 51
  184 1.5 15
  185 33.7 337
  186 6.3 63
  187 1.7 17
  225 1 10
  227 11.8 118
  228 2.8 28
  229 1.6 16
  241 1.2 12
  242 1.6 16
  252 5.8 58
  253 2.3 23
  255 1 10
  265 1.6 16
  278 1.2 12
  279 2.1 21
  281 2.8 28
  282 1.4 14
  295 3.7 37
  296 2 20
  297 99.99 999
  298 29.6 296
  299 7.1 71
  300 1.1 11
  311 2.7 27
  355 1.7 17
  370 33.6 336
  371 12.7 127
  372 4.9 49