ACCESSION: MSBNK-Fac_Eng_Univ_Tokyo-JP011829
RECORD_TITLE: (4R)-PERHYDRO-3-BENZYL-4-((E)-STYRYL)-1,3-OXAZIN-2-ONE; EI-B; MS
DATE: 2016.01.19 (Created 2008.10.21, modified 2011.05.06)
AUTHORS: YOSHINORI Y, FAC. SCIENCE, TOHOKU UNIV.
LICENSE: CC BY-NC-SA

CH$NAME: (4R)-PERHYDRO-3-BENZYL-4-((E)-STYRYL)-1,3-OXAZIN-2-ONE
CH$COMPOUND_CLASS: N/A
CH$FORMULA: C19H19NO2
CH$EXACT_MASS: 293.14158
CH$SMILES: N/A
CH$IUPAC: N/A

AC$INSTRUMENT: Unknown
AC$INSTRUMENT_TYPE: EI-B
AC$MASS_SPECTROMETRY: MS_TYPE MS
AC$MASS_SPECTROMETRY: ION_MODE POSITIVE
AC$MASS_SPECTROMETRY: IONIZATION_ENERGY 20 eV

MS$FOCUSED_ION: ION_TYPE [M]+*

PK$SPLASH: splash10-0006-0940000000-505653350b766128f39f
PK$NUM_PEAK: 6
PK$PEAK: m/z int. rel.int.
  143 15.2 152
  144 99.99 999
  145 10.1 101
  202 3.5 35
  293 36.7 367
  294 20.9 209