ACCESSION: MSBNK-Fac_Eng_Univ_Tokyo-JP011941
RECORD_TITLE: N,N-BIS(TRIMETHYLSILYL)-3-BROMOANILINE; EI-B; MS
DATE: 2016.01.19 (Created 2008.10.21, modified 2011.05.06)
AUTHORS: ISHIKAWA M, HIROSHIMA UNIV. FAC. TEQUNOLOGY
LICENSE: CC BY-NC-SA

CH$NAME: N,N-BIS(TRIMETHYLSILYL)-3-BROMOANILINE
CH$COMPOUND_CLASS: N/A
CH$FORMULA: C12H22BrNSi2
CH$EXACT_MASS: 315.04742
CH$SMILES: Brc(c1)cc(cc1)N([Si](C)(C)C)[Si](C)(C)C
CH$IUPAC: InChI=1S/C12H22BrNSi2/c1-15(2,3)14(16(4,5)6)12-9-7-8-11(13)10-12/h7-10H,1-6H3
CH$LINK: INCHIKEY MDGATTWZVMLJMF-UHFFFAOYSA-N

AC$INSTRUMENT: SHIMADZU QP-1000
AC$INSTRUMENT_TYPE: EI-B
AC$MASS_SPECTROMETRY: MS_TYPE MS
AC$MASS_SPECTROMETRY: ION_MODE POSITIVE
AC$MASS_SPECTROMETRY: IONIZATION_ENERGY 70 eV

MS$FOCUSED_ION: ION_TYPE [M]+*

PK$SPLASH: splash10-0uk9-6019000000-9e3bee25a86696027a23
PK$NUM_PEAK: 40
PK$PEAK: m/z int. rel.int.
  51 1.1 11
  53 2.6 26
  54 2.1 21
  55 4.2 42
  56 1.1 11
  57 3.2 32
  58 5.3 53
  59 18.9 189
  60 1.1 11
  63 1.1 11
  67 2.1 21
  69 3.2 32
  70 5.3 53
  71 1.1 11
  73 99.99 999
  74 8.4 84
  75 8.4 84
  79 2.6 26
  81 2.1 21
  84 1.1 11
  95 1.1 11
  100 2.1 21
  121 4.2 42
  137 1.1 11
  139 1.1 11
  148 6.3 63
  206 12.6 126
  207 2.1 21
  221 12.6 126
  222 3.2 32
  299 10.5 105
  300 75.8 758
  301 18.9 189
  302 82.1 821
  303 18.9 189
  304 6.3 63
  310 12.6 126
  311 2.6 26
  312 13.2 132
  313 2.6 26