ACCESSION: MSBNK-Fac_Eng_Univ_Tokyo-JP011989
RECORD_TITLE: 1,1,4,4-TETRAMETHYL-1,4-DISILACYCLOHEXANE; EI-B; MS
DATE: 2016.01.19 (Created 2008.10.21, modified 2011.05.06)
AUTHORS: YAMAMOTO M, DEP. CHEMISTRY, FAC. SCIENCE, NARA WOMEN'S UNIV.
LICENSE: CC BY-NC-SA

CH$NAME: 1,1,4,4-TETRAMETHYL-1,4-DISILACYCLOHEXANE
CH$COMPOUND_CLASS: N/A
CH$FORMULA: C8H20Si2
CH$EXACT_MASS: 172.11035
CH$SMILES: C[Si](C)(C1)CC[Si](C)(C)C1
CH$IUPAC: InChI=1S/C8H20Si2/c1-9(2)5-7-10(3,4)8-6-9/h5-8H2,1-4H3
CH$LINK: INCHIKEY PBSFHKRMPPPFIU-UHFFFAOYSA-N
CH$LINK: COMPTOX DTXSID40780950

AC$INSTRUMENT: HITACHI RMU-6M
AC$INSTRUMENT_TYPE: EI-B
AC$MASS_SPECTROMETRY: MS_TYPE MS
AC$MASS_SPECTROMETRY: ION_MODE POSITIVE
AC$MASS_SPECTROMETRY: IONIZATION_ENERGY 20 eV

MS$FOCUSED_ION: ION_TYPE [M]+*

PK$SPLASH: splash10-05fr-2900000000-b1d9d9d160754a9699ad
PK$NUM_PEAK: 28
PK$PEAK: m/z int. rel.int.
  58 1.9 19
  59 8.3 83
  71 2.5 25
  73 13.1 131
  83 2 20
  85 14.6 146
  86 3.8 38
  87 6.7 67
  97 42.4 424
  98 5.9 59
  99 4.7 47
  101 3.1 31
  115 3.6 36
  116 58.8 588
  117 11.2 112
  118 5.9 59
  129 30.6 306
  130 5.9 59
  131 3.7 37
  143 12.2 122
  144 6 60
  145 2 20
  157 96.5 965
  158 20.2 202
  159 8.6 86
  172 99.99 999
  173 20.8 208
  174 9.4 94