ACCESSION: MSBNK-Fac_Eng_Univ_Tokyo-JP012230
RECORD_TITLE: 1-DECENE; CI-B; MS
DATE: 2016.01.19 (Created 2008.10.21, modified 2011.05.06)
AUTHORS: IIDA Y, DAISHIMA S, FAC. OF ENGINEERING, SEIKEI UNIV.
LICENSE: CC BY-NC-SA

CH$NAME: 1-DECENE
CH$COMPOUND_CLASS: N/A
CH$FORMULA: C10H20
CH$EXACT_MASS: 140.15650
CH$SMILES: CCCCCCCCC=C
CH$IUPAC: InChI=1S/C10H20/c1-3-5-7-9-10-8-6-4-2/h3H,1,4-10H2,2H3
CH$LINK: CAS 872-05-9
CH$LINK: INCHIKEY AFFLGGQVNFXPEV-UHFFFAOYSA-N
CH$LINK: COMPTOX DTXSID8027329

AC$INSTRUMENT: FINNIGAN-MAT 4500
AC$INSTRUMENT_TYPE: CI-B
AC$MASS_SPECTROMETRY: MS_TYPE MS
AC$MASS_SPECTROMETRY: ION_MODE POSITIVE
AC$MASS_SPECTROMETRY: IONIZATION_ENERGY 120 eV
AC$MASS_SPECTROMETRY: REAGENT_GAS METHANE

PK$SPLASH: splash10-05aa-9100000000-f233b15ebb85fa1dca15
PK$NUM_PEAK: 27
PK$PEAK: m/z int. rel.int.
  55 7.69 77
  56 1.21 12
  57 94.43 944
  58 4.24 42
  69 43.7 437
  70 4.12 41
  71 85.71 857
  72 4.93 49
  81 2.84 28
  82 1.1 11
  83 99.99 999
  84 7.84 78
  85 88.01 880
  86 5.99 60
  97 36.32 363
  98 4.28 43
  99 30.99 310
  100 2.52 25
  111 4.2 42
  112 1.13 11
  113 1.81 18
  125 1.6 16
  127 1.5 15
  139 12.32 123
  140 6.2 62
  141 41.53 415
  142 4.76 48