ACCESSION: MSBNK-Fac_Eng_Univ_Tokyo-JP012235
RECORD_TITLE: 1-PENTADECENE; CI-B; MS
DATE: 2016.01.19 (Created 2008.10.21, modified 2011.05.06)
AUTHORS: IIDA Y, DAISHIMA S, FAC. OF ENGINEERING, SEIKEI UNIV.
LICENSE: CC BY-NC-SA

CH$NAME: 1-PENTADECENE
CH$COMPOUND_CLASS: N/A
CH$FORMULA: C15H30
CH$EXACT_MASS: 210.23475
CH$SMILES: CCCCCCCCCCCCCC=C
CH$IUPAC: InChI=1S/C15H30/c1-3-5-7-9-11-13-15-14-12-10-8-6-4-2/h3H,1,4-15H2,2H3
CH$LINK: CAS 13360-61-7
CH$LINK: INCHIKEY PJLHTVIBELQURV-UHFFFAOYSA-N
CH$LINK: COMPTOX DTXSID1065421

AC$INSTRUMENT: FINNIGAN-MAT 4500
AC$INSTRUMENT_TYPE: CI-B
AC$MASS_SPECTROMETRY: MS_TYPE MS
AC$MASS_SPECTROMETRY: ION_MODE POSITIVE
AC$MASS_SPECTROMETRY: IONIZATION_ENERGY 120 eV
AC$MASS_SPECTROMETRY: REAGENT_GAS METHANE

PK$SPLASH: splash10-06r2-9730000000-8374242367c2058d6c2d
PK$NUM_PEAK: 47
PK$PEAK: m/z int. rel.int.
  55 3.85 39
  57 47.74 477
  58 2.01 20
  69 14.61 146
  70 2.16 22
  71 57.05 571
  72 3.19 32
  81 2.5 25
  82 1.52 15
  83 57.4 574
  84 4.81 48
  85 43.29 433
  86 2.47 25
  95 2.3 23
  96 1.16 12
  97 99.99 999
  98 8.57 86
  99 42.33 423
  100 3.3 33
  109 1.35 14
  111 63.49 635
  112 6.34 63
  113 39.11 391
  114 3.43 34
  125 43.36 434
  126 4.78 48
  127 33.9 339
  128 3.33 33
  139 28.63 286
  140 3.48 35
  141 22.71 227
  142 2.56 26
  153 17.71 177
  154 2.39 24
  155 17.17 172
  156 2.05 21
  167 6.22 62
  168 1.17 12
  169 10.92 109
  170 1.41 14
  183 3.05 31
  197 1.63 16
  209 59.11 591
  210 16.32 163
  211 69.11 691
  212 10.94 109
  239 1.64 16