ACCESSION: MSBNK-Fac_Eng_Univ_Tokyo-JP012341
RECORD_TITLE: FLUORENE; CI-B; MS
DATE: 2016.01.19 (Created 2008.10.21, modified 2011.05.06)
AUTHORS: IIDA Y, DAISHIMA S, FAC. OF ENGINEERING, SEIKEI UNIV.
LICENSE: CC BY-NC-SA

CH$NAME: FLUORENE
CH$COMPOUND_CLASS: N/A
CH$FORMULA: C13H10
CH$EXACT_MASS: 166.07825
CH$SMILES: c(c3)cc(C1)c(c3)c(c2)c(ccc2)1
CH$IUPAC: InChI=1S/C13H10/c1-3-7-12-10(5-1)9-11-6-2-4-8-13(11)12/h1-8H,9H2
CH$LINK: CAS 86-73-7
CH$LINK: INCHIKEY NIHNNTQXNPWCJQ-UHFFFAOYSA-N
CH$LINK: COMPTOX DTXSID8024105

AC$INSTRUMENT: FINNIGAN-MAT 4500
AC$INSTRUMENT_TYPE: CI-B
AC$MASS_SPECTROMETRY: MS_TYPE MS
AC$MASS_SPECTROMETRY: ION_MODE POSITIVE
AC$MASS_SPECTROMETRY: IONIZATION_ENERGY 120 eV
AC$MASS_SPECTROMETRY: REAGENT_GAS METHANE

PK$SPLASH: splash10-014i-0900000000-c968044f1f87857aa089
PK$NUM_PEAK: 7
PK$PEAK: m/z int. rel.int.
  165 1.42 14
  166 9.83 98
  167 99.99 999
  168 13.69 137
  195 20.6 206
  196 3.22 32
  207 4.63 46