ACCESSION: MSBNK-Fac_Eng_Univ_Tokyo-JP012373
RECORD_TITLE: 9-PHENYLANTHRACENE; CI-B; MS
DATE: 2016.01.19 (Created 2008.10.21, modified 2011.05.06)
AUTHORS: IIDA Y, DAISHIMA S, FAC. OF ENGINEERING, SEIKEI UNIV.
LICENSE: CC BY-NC-SA

CH$NAME: 9-PHENYLANTHRACENE
CH$COMPOUND_CLASS: N/A
CH$FORMULA: C20H14
CH$EXACT_MASS: 254.10955
CH$SMILES: c(c4)ccc(c4)c(c21)c(c3)c(ccc3)cc(cccc2)1
CH$IUPAC: InChI=1S/C20H14/c1-2-8-15(9-3-1)20-18-12-6-4-10-16(18)14-17-11-5-7-13-19(17)20/h1-14H
CH$LINK: CAS 602-55-1
CH$LINK: INCHIKEY LUBXLGUQZVKOFP-UHFFFAOYSA-N
CH$LINK: COMPTOX DTXSID3075254

AC$INSTRUMENT: FINNIGAN-MAT 4500
AC$INSTRUMENT_TYPE: CI-B
AC$MASS_SPECTROMETRY: MS_TYPE MS
AC$MASS_SPECTROMETRY: ION_MODE POSITIVE
AC$MASS_SPECTROMETRY: IONIZATION_ENERGY 120 eV
AC$MASS_SPECTROMETRY: REAGENT_GAS METHANE

PK$SPLASH: splash10-0a4i-0090000000-2f108fd4371ccf963494
PK$NUM_PEAK: 8
PK$PEAK: m/z int. rel.int.
  179 2.48 25
  254 36.15 362
  255 99.99 999
  256 18.07 181
  257 2.03 20
  283 17.23 172
  284 3.96 40
  295 2.67 27