ACCESSION: MSBNK-Fukuyama_Univ-FU000205
RECORD_TITLE: Gal2GlcNAc2Man3GlcNAcFucGlcNAc; LC-ESI-QQ; MS2; CE:20V; Amide
DATE: 2016.01.19 (Created 2009.08.19, modified 2011.05.06)
AUTHORS: Matsuura F, Ohta M, Kittaka M, Faculty of Life Science and Biotechnology, Fukuyama University
LICENSE: CC BY-SA
COMMENT: [Chemical] Source; human IgG

CH$NAME: Gal2GlcNAc2Man3GlcNAcFucGlcNAc
CH$NAME: Gal-beta-1-4GlcNAc-beta-1-2Man-alpha-1-6(Gal-beta-1-4GlcNAc-beta-1-2Man-alpha-1-3)Man-beta-1-4GlcNAc-beta-1-4(Fuc-alpha-1-6)GlcNAc
CH$COMPOUND_CLASS: Natural Product; Oligosaccharide; N-linked glycan; Complex type
CH$FORMULA: C68H114N4O50
CH$EXACT_MASS: 1786.65008
CH$SMILES: OCC(C(O)1)OC(OCC(O4)C(O)C(OC(C8OC(O9)C(NC(C)=O)C(C(OC(O%10)C(O)C(O)C(O)C(CO)%10)C9CO)O)OC(C(C8O)O)CO)C(C4OC(C(CO)5)C(O)C(NC(C)=O)C(OC(C6COC(O7)C(C(C(C(C)7)O)O)O)C(C(C(O6)O)NC(C)=O)O)O5)O)C(OC(O3)C(NC(C)=O)C(O)C(C(CO)3)OC(C2O)OC(C(C2O)O)CO)C1O
CH$IUPAC: InChI=1S/C68H114N4O50/c1-15-33(84)43(94)48(99)63(106-15)104-14-28-55(39(90)29(59(103)107-28)69-16(2)80)116-60-30(70-17(3)81)40(91)54(26(12-79)112-60)119-66-51(102)56(120-68-58(47(98)37(88)23(9-76)111-68)122-62-32(72-19(5)83)42(93)53(25(11-78)114-62)118-65-50(101)45(96)35(86)21(7-74)109-65)38(89)27(115-66)13-105-67-57(46(97)36(87)22(8-75)110-67)121-61-31(71-18(4)82)41(92)52(24(10-77)113-61)117-64-49(100)44(95)34(85)20(6-73)108-64/h15,20-68,73-79,84-103H,6-14H2,1-5H3,(H,69,80)(H,70,81)(H,71,82)(H,72,83)/t15-,20+,21+,22+,23+,24+,25+,26+,27+,28+,29+,30+,31+,32+,33+,34-,35-,36+,37+,38+,39+,40+,41+,42+,43+,44-,45-,46-,47-,48-,49+,50+,51-,52+,53+,54+,55+,56-,57-,58-,59+,60-,61-,62-,63+,64-,65-,66-,67-,68+/m0/s1
CH$LINK: CHEMSPIDER 24606136
CH$LINK: KEGG G00260
CH$LINK: INCHIKEY WWOGFSBVRNWZBV-KVMLNOKXSA-N

AC$INSTRUMENT: 2695 HPLC Quadro Micro API, Waters
AC$INSTRUMENT_TYPE: LC-ESI-QQ
AC$MASS_SPECTROMETRY: MS_TYPE MS2
AC$MASS_SPECTROMETRY: ION_MODE POSITIVE
AC$MASS_SPECTROMETRY: COLLISION_ENERGY 20.0 V
AC$MASS_SPECTROMETRY: DATAFORMAT Centroid
AC$MASS_SPECTROMETRY: DESOLVATION_GAS_FLOW 897 L/Hr
AC$MASS_SPECTROMETRY: DESOLVATION_TEMPERATURE 399 C
AC$MASS_SPECTROMETRY: FRAGMENTATION_MODE LOW-ENERGY CID
AC$MASS_SPECTROMETRY: IONIZATION ESI
AC$MASS_SPECTROMETRY: SCANNING 1 amu/sec (m/z = 20-2040)
AC$MASS_SPECTROMETRY: SOURCE_TEMPERATURE 100 C
AC$CHROMATOGRAPHY: COLUMN_NAME TSK-GEL Amide-80 2.0 mm X 250 mm (TOSOH)
AC$CHROMATOGRAPHY: COLUMN_TEMPERATURE 40 C
AC$CHROMATOGRAPHY: FLOW_GRADIENT 74/26 at 0 min, 50/50 at 60 min.
AC$CHROMATOGRAPHY: FLOW_RATE 0.2 ml/min
AC$CHROMATOGRAPHY: RETENTION_TIME 34.991 min
AC$CHROMATOGRAPHY: SAMPLING_CONE 23.08 V
AC$CHROMATOGRAPHY: SOLVENT A CH3CN
AC$CHROMATOGRAPHY: SOLVENT B H2O

MS$FOCUSED_ION: DERIVATIVE_FORM C77H125N5O51
MS$FOCUSED_ION: DERIVATIVE_MASS 1935.73414
MS$FOCUSED_ION: DERIVATIVE_TYPE ABEE (p-Aminobenzoic acid ethyl ester)
MS$FOCUSED_ION: PRECURSOR_M/Z 1936.00
MS$FOCUSED_ION: PRECURSOR_TYPE [M+H]+

PK$SPLASH: splash10-000i-0000000009-afb2e537a1ee96095b72
PK$NUM_PEAK: 25
PK$PEAK: m/z int. rel.int.
  365.5 4319 51
  512.1 877.0 10
  1045.3 1009 12
  1055.2 1084 13
  1060.1 926.0 11
  1204.5 1394 16
  1418.1 1486 17
  1419.1 1263 15
  1421.4 876.0 10
  1568.7 2763 33
  1569.6 7918 93
  1570.7 13260 156
  1571.5 1560 18
  1572.3 4755 56
  1774.7 866.0 10
  1923.9 1365 16
  1933.0 6114 72
  1933.6 30240 356
  1934.4 44210 520
  1935.3 68320 804
  1935.8 6848 81
  1936.4 84930 999
  1937.2 37730 444
  1938.0 8608 101
  1938.6 1891 22