ACCESSION: MSBNK-GL_Sciences_Inc-GLS00002
RECORD_TITLE: Sarcosine; EI-B; MS; 2 TMS; RT: 359.28 s
DATE: 2016.01.19 (Created 2012.08.03, modified 2013.07.31)
AUTHORS: Miyagawa H, Akimoto S, Yamasaki K, GL Sciences Inc.
LICENSE: CC BY-SA
COPYRIGHT: GL Sciences Inc.
COMMENT: The chemical compound was chemically modified with N-methyl-N-trimethylsilyl-trifluoroacetamide(MSTFA) before GC-MS analysis. When it has two or more functional groups, this modification gave a mixture of the TMS derivatives having different number of TMS groups at different functional groups.

CH$NAME: Sarcosine
CH$NAME: N-MethylGlycine
CH$COMPOUND_CLASS: Natural Product
CH$FORMULA: C3H7NO2
CH$EXACT_MASS: 89.04768
CH$SMILES: CNCC(O)=O
CH$IUPAC: InChI=1S/C3H7NO2/c1-4-2-3(5)6/h4H,2H2,1H3,(H,5,6)
CH$LINK: CAS 107-97-1
CH$LINK: CHEBI 15611
CH$LINK: KEGG C00213
CH$LINK: PUBCHEM 3513
CH$LINK: INCHIKEY FSYKKLYZXJSNPZ-UHFFFAOYSA-N
CH$LINK: COMPTOX DTXSID1047025

AC$INSTRUMENT: GCMS-2010 Plus, Shimadzu
AC$INSTRUMENT_TYPE: EI-B
AC$MASS_SPECTROMETRY: MS_TYPE MS
AC$MASS_SPECTROMETRY: ION_MODE POSITIVE
AC$MASS_SPECTROMETRY: GAS_PRESSURE 75 kPa
AC$MASS_SPECTROMETRY: ION_SOURCE_TEMPERATURE 200 C
AC$MASS_SPECTROMETRY: SCAN_RANGE_M/Z 85-500
AC$CHROMATOGRAPHY: COLUMN_NAME InertCap 5MS/NP 0.25 mmI.D. x 30 m, df=0.25 um
AC$CHROMATOGRAPHY: INJECTION_TEMPERATURE 230 C
AC$CHROMATOGRAPHY: OVEN_TEMPERATURE 80 C(2 min)-15 C/min - 330C
AC$CHROMATOGRAPHY: RETENTION_INDEX 1143
AC$CHROMATOGRAPHY: RETENTION_TIME 359.28
AC$CHROMATOGRAPHY: TRANSFARLINE_TEMPERATURE 250 C

MS$FOCUSED_ION: DERIVATIVE_TYPE 2 TMS
MS$DATA_PROCESSING: WHOLE GCMSsolution

PK$SPLASH: splash10-014i-0900000000-22864bae97055c3845b6
PK$NUM_PEAK: 343
PK$PEAK: m/z int. rel.int.
  86.500000 31767.000000 14
  87.500000 23708.000000 11
  88.450000 4102.000000 2
  89.500000 529.000000 1
  90.500000 169.000000 1
  91.500000 191.000000 1
  92.500000 298.000000 1
  94.000000 4289.000000 2
  94.950000 797.000000 1
  96.000000 215.000000 1
  97.000000 110.000000 1
  98.000000 518.000000 1
  99.050000 1407.000000 1
  100.050000 15964.000000 7
  101.550000 21176.000000 10
  103.000000 8882.000000 4
  104.050000 1120.000000 1
  105.050000 3294.000000 1
  106.100000 374.000000 1
  107.100000 134.000000 1
  108.100000 27.000000 1
  109.100000 998.000000 1
  110.100000 121.000000 1
  111.100000 135.000000 1
  112.100000 262.000000 1
  113.050000 1001.000000 1
  114.100000 7167.000000 3
  115.150000 16334.000000 7
  116.100000 2216870.000000 999
  117.100000 240369.000000 108
  118.100000 83215.000000 37
  119.100000 9314.000000 4
  120.100000 650.000000 1
  121.100000 495.000000 1
  123.100000 54.000000 1
  124.100000 21.000000 1
  125.100000 113.000000 1
  126.100000 58.000000 1
  127.100000 105.000000 1
  128.100000 1527.000000 1
  129.100000 545.000000 1
  130.100000 921.000000 1
  131.050000 17148.000000 8
  132.050000 3060.000000 1
  133.050000 22138.000000 10
  134.050000 3037.000000 1
  135.050000 1932.000000 1
  136.000000 183.000000 1
  137.000000 55.000000 1
  139.000000 55.000000 1
  140.000000 321.000000 1
  141.000000 60.000000 1
  142.000000 279.000000 1
  143.100000 98.000000 1
  144.100000 10252.000000 5
  145.100000 1586.000000 1
  146.150000 4455.000000 2
  147.100000 323086.000000 146
  148.100000 51220.000000 23
  149.100000 25140.000000 11
  150.100000 2476.000000 1
  151.100000 599.000000 1
  152.100000 178.000000 1
  153.100000 105.000000 1
  154.100000 2.000000 1
  155.100000 81.000000 1
  156.100000 130.000000 1
  157.100000 42.000000 1
  158.100000 1159.000000 1
  159.100000 370.000000 1
  160.100000 1001.000000 1
  161.100000 1426.000000 1
  162.100000 303.000000 1
  163.100000 234.000000 1
  164.100000 122.000000 1
  165.100000 79.000000 1
  166.100000 62.000000 1
  167.100000 73.000000 1
  168.100000 52.000000 1
  169.100000 66.000000 1
  170.100000 44.000000 1
  172.100000 839.000000 1
  173.100000 190.000000 1
  174.150000 815.000000 1
  175.050000 11721.000000 5
  176.050000 1964.000000 1
  177.050000 1073.000000 1
  178.000000 178.000000 1
  179.000000 62.000000 1
  180.000000 49.000000 1
  181.000000 47.000000 1
  182.000000 60.000000 1
  183.000000 39.000000 1
  185.000000 38.000000 1
  187.000000 3.000000 1
  188.100000 1614.000000 1
  189.150000 2230.000000 1
  190.050000 82330.000000 37
  191.050000 15876.000000 7
  192.050000 6886.000000 3
  193.100000 977.000000 1
  194.100000 242.000000 1
  195.100000 89.000000 1
  196.100000 26.000000 1
  197.100000 44.000000 1
  200.100000 103.000000 1
  201.100000 29.000000 1
  202.100000 63.000000 1
  203.100000 180.000000 1
  204.150000 3932.000000 2
  205.100000 594.000000 1
  206.100000 484.000000 1
  207.100000 406.000000 1
  208.100000 161.000000 1
  209.100000 127.000000 1
  211.100000 6.000000 1
  212.100000 30.000000 1
  213.100000 31.000000 1
  214.100000 30.000000 1
  216.100000 119.000000 1
  217.100000 591.000000 1
  218.100000 67127.000000 30
  219.050000 13961.000000 6
  220.050000 6032.000000 3
  221.100000 666.000000 1
  222.100000 188.000000 1
  223.100000 148.000000 1
  226.100000 41.000000 1
  227.100000 10.000000 1
  228.100000 44.000000 1
  229.100000 52.000000 1
  230.100000 185.000000 1
  231.100000 94.000000 1
  232.150000 1359.000000 1
  233.100000 40554.000000 18
  234.050000 8693.000000 4
  235.150000 3888.000000 2
  236.100000 687.000000 1
  237.100000 140.000000 1
  238.100000 18.000000 1
  239.100000 111.000000 1
  241.100000 78.000000 1
  242.100000 52.000000 1
  243.100000 14.000000 1
  244.100000 36.000000 1
  245.100000 21.000000 1
  247.100000 36.000000 1
  248.100000 21.000000 1
  249.100000 6.000000 1
  251.100000 74.000000 1
  252.100000 57.000000 1
  253.100000 244.000000 1
  254.100000 21.000000 1
  255.100000 46.000000 1
  256.100000 81.000000 1
  257.100000 50.000000 1
  258.100000 39.000000 1
  259.100000 68.000000 1
  260.100000 46.000000 1
  261.100000 62.000000 1
  262.100000 14.000000 1
  263.100000 63.000000 1
  264.100000 188.000000 1
  265.100000 110.000000 1
  269.100000 58.000000 1
  270.100000 63.000000 1
  271.100000 38.000000 1
  272.100000 27.000000 1
  273.100000 87.000000 1
  274.100000 132.000000 1
  275.100000 68.000000 1
  276.100000 65.000000 1
  277.100000 70.000000 1
  279.100000 18.000000 1
  280.100000 46.000000 1
  281.100000 89.000000 1
  282.100000 70.000000 1
  283.100000 73.000000 1
  284.100000 49.000000 1
  285.100000 19.000000 1
  286.100000 13.000000 1
  288.100000 10.000000 1
  289.100000 3.000000 1
  290.100000 50.000000 1
  291.100000 49.000000 1
  292.100000 2.000000 1
  293.100000 47.000000 1
  294.100000 121.000000 1
  295.100000 21.000000 1
  298.100000 81.000000 1
  299.100000 127.000000 1
  300.100000 21.000000 1
  301.100000 52.000000 1
  302.100000 196.000000 1
  303.100000 39.000000 1
  304.100000 41.000000 1
  305.100000 54.000000 1
  306.100000 130.000000 1
  307.100000 191.000000 1
  308.100000 158.000000 1
  309.100000 287.000000 1
  310.100000 143.000000 1
  312.100000 113.000000 1
  313.100000 62.000000 1
  314.100000 58.000000 1
  316.100000 62.000000 1
  317.100000 16.000000 1
  318.100000 156.000000 1
  319.100000 92.000000 1
  320.100000 73.000000 1
  321.100000 145.000000 1
  322.100000 5.000000 1
  324.100000 39.000000 1
  325.100000 63.000000 1
  326.100000 13.000000 1
  327.100000 42.000000 1
  328.100000 44.000000 1
  329.100000 130.000000 1
  330.100000 14.000000 1
  331.100000 97.000000 1
  332.100000 26.000000 1
  334.100000 44.000000 1
  336.100000 13.000000 1
  338.100000 47.000000 1
  339.100000 44.000000 1
  340.100000 41.000000 1
  341.100000 8.000000 1
  342.100000 92.000000 1
  344.100000 98.000000 1
  345.100000 21.000000 1
  346.100000 84.000000 1
  347.100000 36.000000 1
  348.100000 26.000000 1
  349.100000 38.000000 1
  352.100000 29.000000 1
  354.100000 22.000000 1
  356.100000 65.000000 1
  357.100000 34.000000 1
  358.100000 42.000000 1
  359.100000 22.000000 1
  361.100000 10.000000 1
  362.100000 74.000000 1
  363.100000 10.000000 1
  364.100000 46.000000 1
  365.100000 46.000000 1
  367.100000 36.000000 1
  368.100000 66.000000 1
  369.100000 108.000000 1
  370.100000 79.000000 1
  371.100000 55.000000 1
  372.100000 50.000000 1
  373.100000 30.000000 1
  374.100000 47.000000 1
  377.100000 14.000000 1
  378.100000 22.000000 1
  380.100000 10.000000 1
  381.100000 78.000000 1
  382.100000 21.000000 1
  383.100000 39.000000 1
  384.100000 62.000000 1
  385.100000 47.000000 1
  387.100000 22.000000 1
  389.100000 34.000000 1
  392.100000 46.000000 1
  393.100000 62.000000 1
  395.100000 29.000000 1
  396.100000 127.000000 1
  397.100000 19.000000 1
  398.100000 63.000000 1
  399.100000 49.000000 1
  403.100000 10.000000 1
  404.100000 76.000000 1
  405.100000 76.000000 1
  406.100000 63.000000 1
  407.100000 87.000000 1
  408.100000 60.000000 1
  410.100000 24.000000 1
  412.100000 36.000000 1
  413.100000 44.000000 1
  414.100000 19.000000 1
  415.100000 100.000000 1
  416.100000 47.000000 1
  417.100000 6.000000 1
  418.100000 34.000000 1
  419.100000 103.000000 1
  420.100000 63.000000 1
  423.100000 41.000000 1
  424.100000 30.000000 1
  425.100000 66.000000 1
  426.100000 73.000000 1
  427.100000 76.000000 1
  428.100000 46.000000 1
  429.100000 38.000000 1
  431.100000 138.000000 1
  433.100000 78.000000 1
  434.100000 39.000000 1
  435.100000 21.000000 1
  436.100000 36.000000 1
  438.100000 30.000000 1
  441.100000 38.000000 1
  442.100000 24.000000 1
  444.100000 118.000000 1
  445.100000 89.000000 1
  446.100000 49.000000 1
  447.100000 13.000000 1
  449.100000 46.000000 1
  451.100000 31.000000 1
  453.100000 60.000000 1
  454.100000 14.000000 1
  455.100000 86.000000 1
  456.100000 62.000000 1
  457.100000 71.000000 1
  458.100000 38.000000 1
  460.100000 2.000000 1
  461.100000 16.000000 1
  462.100000 97.000000 1
  463.100000 33.000000 1
  464.100000 13.000000 1
  465.100000 34.000000 1
  467.100000 54.000000 1
  469.100000 30.000000 1
  470.100000 50.000000 1
  471.100000 11.000000 1
  472.100000 24.000000 1
  473.100000 68.000000 1
  476.100000 14.000000 1
  477.100000 42.000000 1
  478.100000 90.000000 1
  479.100000 24.000000 1
  480.100000 16.000000 1
  481.100000 50.000000 1
  482.100000 62.000000 1
  484.100000 18.000000 1
  487.100000 11.000000 1
  489.100000 57.000000 1
  490.100000 41.000000 1
  491.100000 46.000000 1
  492.100000 38.000000 1
  493.100000 58.000000 1
  496.100000 29.000000 1
  497.100000 89.000000 1
  498.100000 13.000000 1
  499.100000 11.000000 1