ACCESSION: MSBNK-GL_Sciences_Inc-GLS00005
RECORD_TITLE: beta-Cyano-L-Alanine; EI-B; MS; n TMS; RT: 512.64 s
DATE: 2016.01.19 (Created 2012.08.03, modified 2013.07.31)
AUTHORS: Miyagawa H, Akimoto S, Yamasaki K, GL Sciences Inc.
LICENSE: CC BY-SA
COPYRIGHT: GL Sciences Inc.
COMMENT: The chemical compound was chemically modified with N-methyl-N-trimethylsilyl-trifluoroacetamide(MSTFA) before GC-MS analysis. When it has two or more functional groups, this modification gave a mixture of the TMS derivatives having different number of TMS groups at different functional groups.

CH$NAME: beta-Cyano-L-Alanine
CH$NAME: b-Cyano-L-Alanine
CH$COMPOUND_CLASS: Natural Product
CH$FORMULA: C4H6N2O2
CH$EXACT_MASS: 114.04293
CH$SMILES: N#CC[C@H](N)C(O)=O
CH$IUPAC: InChI=1S/C4H6N2O2/c5-2-1-3(6)4(7)8/h3H,1,6H2,(H,7,8)/t3-/m0/s1
CH$LINK: CAS 6232-19-5
CH$LINK: CHEBI 16934
CH$LINK: KEGG C02512
CH$LINK: PUBCHEM 5522
CH$LINK: INCHIKEY BXRLWGXPSRYJDZ-VKHMYHEASA-N
CH$LINK: COMPTOX DTXSID90977873

AC$INSTRUMENT: GCMS-2010 Plus, Shimadzu
AC$INSTRUMENT_TYPE: EI-B
AC$MASS_SPECTROMETRY: MS_TYPE MS
AC$MASS_SPECTROMETRY: ION_MODE POSITIVE
AC$MASS_SPECTROMETRY: GAS_PRESSURE 75 kPa
AC$MASS_SPECTROMETRY: ION_SOURCE_TEMPERATURE 200 C
AC$MASS_SPECTROMETRY: SCAN_RANGE_M/Z 85-500
AC$CHROMATOGRAPHY: COLUMN_NAME InertCap 5MS/NP 0.25 mmI.D. x 30 m, df=0.25 um
AC$CHROMATOGRAPHY: INJECTION_TEMPERATURE 230 C
AC$CHROMATOGRAPHY: OVEN_TEMPERATURE 80 C(2 min)-15 C/min - 330C
AC$CHROMATOGRAPHY: RETENTION_INDEX 1381
AC$CHROMATOGRAPHY: RETENTION_TIME 512.64
AC$CHROMATOGRAPHY: TRANSFARLINE_TEMPERATURE 250 C

MS$FOCUSED_ION: DERIVATIVE_TYPE n TMS
MS$DATA_PROCESSING: WHOLE GCMSsolution

PK$SPLASH: splash10-0006-0910000000-76fcf98a116d8f5fb3a3
PK$NUM_PEAK: 362
PK$PEAK: m/z int. rel.int.
  86.050000 10355.000000 7
  87.000000 5204.000000 3
  88.000000 2449.000000 2
  89.000000 2838.000000 2
  90.000000 372.000000 1
  91.000000 543.000000 1
  92.000000 145.000000 1
  93.000000 260.000000 1
  94.000000 150.000000 1
  95.000000 682.000000 1
  96.000000 854.000000 1
  97.050000 1230.000000 1
  98.050000 25349.000000 16
  99.100000 7228.000000 5
  100.100000 119983.000000 78
  101.050000 14987.000000 10
  102.050000 7440.000000 5
  103.050000 61214.000000 40
  104.050000 5372.000000 3
  105.050000 4984.000000 3
  106.000000 676.000000 1
  107.000000 167.000000 1
  108.000000 148.000000 1
  109.000000 41.000000 1
  110.100000 414.000000 1
  111.050000 4073.000000 3
  112.050000 1579.000000 1
  113.050000 2746.000000 2
  114.100000 30657.000000 20
  115.100000 25671.000000 17
  116.050000 8766.000000 6
  117.050000 12663.000000 8
  118.100000 1999.000000 1
  119.050000 2089.000000 1
  120.100000 385.000000 1
  121.100000 372.000000 1
  122.100000 49.000000 1
  123.100000 210.000000 1
  124.100000 231.000000 1
  125.100000 9271.000000 6
  126.100000 3036.000000 2
  127.100000 978.000000 1
  128.100000 1788.000000 1
  129.100000 1207.000000 1
  130.050000 27853.000000 18
  131.100000 25215.000000 16
  132.050000 16065.000000 10
  133.050000 18317.000000 12
  134.050000 3728.000000 2
  135.050000 1414.000000 1
  136.100000 250.000000 1
  137.100000 119.000000 1
  138.100000 207.000000 1
  139.100000 1329.000000 1
  140.150000 10359.000000 7
  141.100000 1543065.000000 999
  142.100000 185610.000000 120
  143.100000 59162.000000 38
  144.100000 9166.000000 6
  145.100000 1206.000000 1
  146.150000 2869.000000 2
  147.100000 358414.000000 232
  148.100000 55836.000000 36
  149.100000 29010.000000 19
  150.100000 3180.000000 2
  151.100000 582.000000 1
  152.100000 143.000000 1
  153.100000 8746.000000 6
  154.100000 3374.000000 2
  155.100000 950.000000 1
  156.100000 1041.000000 1
  157.100000 617.000000 1
  158.100000 4100.000000 3
  159.150000 2134.000000 1
  160.100000 3463.000000 2
  161.100000 980.000000 1
  162.100000 439.000000 1
  163.100000 1428.000000 1
  164.100000 290.000000 1
  165.100000 118.000000 1
  166.100000 127.000000 1
  167.100000 38.000000 1
  168.100000 103.000000 1
  169.100000 634.000000 1
  170.100000 250.000000 1
  171.100000 76.000000 1
  172.100000 2454.000000 2
  173.100000 954.000000 1
  174.100000 4407.000000 3
  175.050000 1130.000000 1
  176.100000 508.000000 1
  177.100000 273.000000 1
  178.100000 82.000000 1
  179.100000 124.000000 1
  180.100000 13.000000 1
  181.100000 86.000000 1
  182.100000 161.000000 1
  183.100000 137.000000 1
  184.100000 49.000000 1
  185.100000 82.000000 1
  186.100000 132.000000 1
  187.100000 119.000000 1
  188.100000 876.000000 1
  189.100000 262.000000 1
  190.050000 1698.000000 1
  191.050000 1423.000000 1
  192.100000 415.000000 1
  193.100000 87.000000 1
  194.100000 60.000000 1
  195.100000 198.000000 1
  196.100000 41.000000 1
  197.100000 119.000000 1
  198.000000 122.000000 1
  199.000000 1972.000000 1
  200.000000 639.000000 1
  201.000000 618.000000 1
  202.050000 107760.000000 70
  203.050000 24416.000000 16
  204.050000 9734.000000 6
  205.050000 1580.000000 1
  206.000000 313.000000 1
  207.000000 550.000000 1
  208.000000 71.000000 1
  209.000000 130.000000 1
  210.000000 78.000000 1
  212.000000 27.000000 1
  213.000000 474.000000 1
  214.100000 409.000000 1
  215.100000 68244.000000 44
  216.100000 15620.000000 10
  217.100000 7258.000000 5
  218.050000 29090.000000 19
  219.050000 6720.000000 4
  220.050000 2543.000000 2
  221.100000 383.000000 1
  222.100000 150.000000 1
  223.100000 66.000000 1
  224.100000 81.000000 1
  225.050000 1822.000000 1
  226.100000 538.000000 1
  227.100000 551.000000 1
  228.100000 209.000000 1
  229.100000 124.000000 1
  230.100000 79.000000 1
  231.100000 33.000000 1
  232.100000 145.000000 1
  234.100000 34.000000 1
  235.100000 31.000000 1
  236.100000 5.000000 1
  238.100000 36.000000 1
  239.100000 68.000000 1
  240.100000 121.000000 1
  241.100000 714.000000 1
  242.100000 551.000000 1
  243.100000 53694.000000 35
  244.100000 11060.000000 7
  245.100000 5334.000000 3
  246.100000 775.000000 1
  247.100000 271.000000 1
  248.100000 110.000000 1
  249.100000 90.000000 1
  250.100000 6.000000 1
  251.100000 63.000000 1
  252.100000 76.000000 1
  253.100000 751.000000 1
  254.100000 225.000000 1
  255.100000 145.000000 1
  256.100000 233.000000 1
  257.100000 223.000000 1
  258.100000 106.000000 1
  259.100000 470.000000 1
  260.100000 110.000000 1
  261.100000 94.000000 1
  262.100000 81.000000 1
  263.100000 95.000000 1
  264.100000 127.000000 1
  265.100000 42.000000 1
  266.100000 106.000000 1
  267.100000 86.000000 1
  268.100000 199.000000 1
  269.100000 265.000000 1
  270.100000 36.000000 1
  271.100000 34.000000 1
  272.100000 87.000000 1
  273.100000 27.000000 1
  274.100000 73.000000 1
  275.100000 55.000000 1
  276.100000 52.000000 1
  277.100000 84.000000 1
  278.100000 44.000000 1
  279.100000 150.000000 1
  280.100000 66.000000 1
  281.100000 122.000000 1
  282.100000 44.000000 1
  283.100000 62.000000 1
  284.100000 19.000000 1
  285.100000 73.000000 1
  286.100000 19.000000 1
  287.100000 24.000000 1
  288.100000 41.000000 1
  290.100000 358.000000 1
  291.100000 66.000000 1
  292.100000 140.000000 1
  293.100000 42.000000 1
  294.100000 306.000000 1
  296.100000 82.000000 1
  297.100000 46.000000 1
  299.100000 177.000000 1
  300.100000 11.000000 1
  301.100000 73.000000 1
  302.100000 63.000000 1
  304.100000 97.000000 1
  305.100000 60.000000 1
  306.100000 50.000000 1
  307.100000 521.000000 1
  308.100000 158.000000 1
  309.100000 631.000000 1
  310.100000 34.000000 1
  311.100000 142.000000 1
  312.100000 55.000000 1
  313.100000 103.000000 1
  314.100000 2.000000 1
  315.100000 60.000000 1
  316.100000 62.000000 1
  317.100000 81.000000 1
  318.100000 47.000000 1
  320.100000 73.000000 1
  321.100000 34.000000 1
  323.100000 2.000000 1
  324.100000 30.000000 1
  326.100000 46.000000 1
  327.100000 204.000000 1
  329.100000 46.000000 1
  330.100000 70.000000 1
  331.100000 698.000000 1
  332.100000 366.000000 1
  333.100000 119.000000 1
  334.100000 14.000000 1
  335.100000 90.000000 1
  336.100000 76.000000 1
  337.100000 13.000000 1
  339.100000 6.000000 1
  340.100000 46.000000 1
  341.100000 134.000000 1
  342.100000 22.000000 1
  343.100000 47.000000 1
  344.100000 63.000000 1
  346.100000 198.000000 1
  347.100000 57.000000 1
  348.100000 82.000000 1
  349.100000 5.000000 1
  350.100000 95.000000 1
  351.100000 90.000000 1
  352.100000 24.000000 1
  353.100000 60.000000 1
  354.100000 82.000000 1
  355.100000 63.000000 1
  356.100000 14.000000 1
  357.100000 27.000000 1
  358.100000 63.000000 1
  359.100000 16.000000 1
  360.100000 14.000000 1
  362.100000 39.000000 1
  363.100000 36.000000 1
  364.100000 151.000000 1
  365.100000 78.000000 1
  366.100000 63.000000 1
  368.100000 10.000000 1
  369.100000 94.000000 1
  370.100000 60.000000 1
  372.100000 8.000000 1
  373.100000 68.000000 1
  374.100000 36.000000 1
  375.100000 118.000000 1
  377.100000 70.000000 1
  378.100000 47.000000 1
  380.100000 38.000000 1
  381.100000 113.000000 1
  383.100000 24.000000 1
  384.100000 62.000000 1
  385.100000 16.000000 1
  386.100000 38.000000 1
  387.100000 13.000000 1
  388.100000 10.000000 1
  389.100000 26.000000 1
  392.100000 8.000000 1
  393.100000 52.000000 1
  395.100000 63.000000 1
  396.100000 52.000000 1
  397.100000 3.000000 1
  399.100000 2.000000 1
  400.100000 52.000000 1
  401.100000 24.000000 1
  402.100000 63.000000 1
  405.100000 263.000000 1
  406.100000 124.000000 1
  407.100000 119.000000 1
  408.100000 71.000000 1
  410.100000 36.000000 1
  412.100000 16.000000 1
  414.100000 186.000000 1
  415.100000 126.000000 1
  416.100000 39.000000 1
  418.100000 68.000000 1
  419.100000 18.000000 1
  423.100000 60.000000 1
  424.100000 49.000000 1
  425.100000 21.000000 1
  426.100000 46.000000 1
  427.100000 62.000000 1
  428.100000 106.000000 1
  429.100000 55.000000 1
  431.100000 58.000000 1
  434.100000 49.000000 1
  436.100000 33.000000 1
  437.100000 79.000000 1
  438.100000 31.000000 1
  439.100000 34.000000 1
  440.100000 27.000000 1
  441.100000 16.000000 1
  442.100000 47.000000 1
  443.100000 50.000000 1
  444.100000 46.000000 1
  448.100000 98.000000 1
  449.100000 8.000000 1
  450.100000 21.000000 1
  451.100000 2.000000 1
  452.100000 42.000000 1
  453.100000 19.000000 1
  455.100000 54.000000 1
  456.100000 22.000000 1
  457.100000 54.000000 1
  458.100000 33.000000 1
  459.100000 63.000000 1
  460.100000 42.000000 1
  461.100000 2.000000 1
  462.100000 47.000000 1
  463.100000 76.000000 1
  464.100000 41.000000 1
  466.100000 111.000000 1
  469.100000 2.000000 1
  470.100000 11.000000 1
  471.100000 34.000000 1
  473.100000 46.000000 1
  474.100000 49.000000 1
  475.100000 18.000000 1
  476.100000 50.000000 1
  477.100000 33.000000 1
  478.100000 24.000000 1
  479.100000 54.000000 1
  480.100000 60.000000 1
  483.100000 58.000000 1
  487.100000 33.000000 1
  488.100000 55.000000 1
  489.100000 68.000000 1
  490.100000 65.000000 1
  491.100000 19.000000 1
  493.100000 5.000000 1
  495.100000 13.000000 1
  496.100000 68.000000 1
  498.100000 79.000000 1
  499.100000 74.000000 1