ACCESSION: MSBNK-GL_Sciences_Inc-GLS00012
RECORD_TITLE: L-Valine; EI-B; MS; 2 TMS; RT: 415.49 s
DATE: 2016.01.19 (Created 2012.08.03, modified 2013.07.31)
AUTHORS: Miyagawa H, Akimoto S, Yamasaki K, GL Sciences Inc.
LICENSE: CC BY-SA
COPYRIGHT: GL Sciences Inc.
COMMENT: The chemical compound was chemically modified with N-methyl-N-trimethylsilyl-trifluoroacetamide(MSTFA) before GC-MS analysis. When it has two or more functional groups, this modification gave a mixture of the TMS derivatives having different number of TMS groups at different functional groups.

CH$NAME: L-Valine
CH$COMPOUND_CLASS: Natural Product
CH$FORMULA: C5H11NO2
CH$EXACT_MASS: 117.07898
CH$SMILES: CC(C)[C@H](N)C(O)=O
CH$IUPAC: InChI=1S/C5H11NO2/c1-3(2)4(6)5(7)8/h3-4H,6H2,1-2H3,(H,7,8)/t4-/m0/s1
CH$LINK: CAS 72-18-4
CH$LINK: CHEBI 16414
CH$LINK: KEGG C00183
CH$LINK: PUBCHEM 3483
CH$LINK: INCHIKEY KZSNJWFQEVHDMF-BYPYZUCNSA-N
CH$LINK: COMPTOX DTXSID40883233

AC$INSTRUMENT: GCMS-2010 Plus, Shimadzu
AC$INSTRUMENT_TYPE: EI-B
AC$MASS_SPECTROMETRY: MS_TYPE MS
AC$MASS_SPECTROMETRY: ION_MODE POSITIVE
AC$MASS_SPECTROMETRY: GAS_PRESSURE 75 kPa
AC$MASS_SPECTROMETRY: ION_SOURCE_TEMPERATURE 200 C
AC$MASS_SPECTROMETRY: SCAN_RANGE_M/Z 85-500
AC$CHROMATOGRAPHY: COLUMN_NAME InertCap 5MS/NP 0.25 mmI.D. x 30 m, df=0.25 um
AC$CHROMATOGRAPHY: INJECTION_TEMPERATURE 230 C
AC$CHROMATOGRAPHY: OVEN_TEMPERATURE 80 C(2 min)-15 C/min - 330C
AC$CHROMATOGRAPHY: RETENTION_INDEX 1225
AC$CHROMATOGRAPHY: RETENTION_TIME 415.49
AC$CHROMATOGRAPHY: TRANSFARLINE_TEMPERATURE 250 C

MS$FOCUSED_ION: DERIVATIVE_TYPE 2 TMS
MS$DATA_PROCESSING: WHOLE GCMSsolution

PK$SPLASH: splash10-0006-0910000000-9079324093be9a14d47a
PK$NUM_PEAK: 355
PK$PEAK: m/z int. rel.int.
  86.100000 5412.000000 11
  87.100000 1495.000000 3
  88.100000 782.000000 2
  89.100000 558.000000 1
  90.100000 710.000000 1
  91.100000 279.000000 1
  92.100000 102.000000 1
  93.100000 358.000000 1
  94.100000 268.000000 1
  95.100000 153.000000 1
  96.100000 474.000000 1
  97.100000 518.000000 1
  98.100000 1338.000000 3
  99.150000 1366.000000 3
  100.100000 40022.000000 79
  101.100000 5606.000000 11
  102.050000 2884.000000 6
  103.050000 7316.000000 14
  104.000000 679.000000 1
  105.000000 918.000000 2
  106.000000 210.000000 1
  107.000000 114.000000 1
  108.000000 162.000000 1
  109.000000 183.000000 1
  110.000000 191.000000 1
  111.000000 78.000000 1
  112.100000 1471.000000 3
  113.100000 946.000000 2
  114.100000 3322.000000 7
  115.100000 2215.000000 4
  116.050000 1111.000000 2
  117.050000 3622.000000 7
  118.100000 770.000000 2
  119.000000 1385.000000 3
  120.000000 177.000000 1
  121.000000 191.000000 1
  122.000000 108.000000 1
  123.000000 10.000000 1
  124.000000 33.000000 1
  125.000000 97.000000 1
  126.000000 302.000000 1
  127.100000 271.000000 1
  128.150000 7973.000000 16
  129.150000 5198.000000 10
  130.100000 4694.000000 9
  131.100000 4777.000000 9
  132.100000 4751.000000 9
  133.100000 8585.000000 17
  134.050000 1449.000000 3
  135.100000 748.000000 1
  136.100000 143.000000 1
  137.100000 60.000000 1
  138.100000 126.000000 1
  140.100000 306.000000 1
  141.100000 282.000000 1
  142.200000 2383.000000 5
  143.250000 4446.000000 9
  144.200000 509033.000000 999
  145.200000 70220.000000 138
  146.150000 25080.000000 49
  147.150000 55356.000000 109
  148.100000 9679.000000 19
  149.100000 5425.000000 11
  150.100000 732.000000 1
  151.100000 138.000000 1
  152.100000 46.000000 1
  153.100000 22.000000 1
  154.100000 145.000000 1
  155.100000 16.000000 1
  156.150000 10501.000000 21
  157.150000 1794.000000 4
  158.100000 1295.000000 3
  159.150000 940.000000 2
  160.100000 1033.000000 2
  161.100000 369.000000 1
  162.100000 130.000000 1
  163.200000 2281.000000 4
  164.200000 369.000000 1
  165.200000 239.000000 1
  166.200000 108.000000 1
  167.200000 36.000000 1
  168.200000 105.000000 1
  169.200000 30.000000 1
  170.200000 81.000000 1
  171.200000 97.000000 1
  172.200000 439.000000 1
  173.200000 111.000000 1
  174.100000 1676.000000 3
  175.100000 508.000000 1
  176.100000 185.000000 1
  177.100000 190.000000 1
  178.100000 92.000000 1
  179.100000 78.000000 1
  180.100000 22.000000 1
  181.100000 33.000000 1
  182.100000 55.000000 1
  183.100000 121.000000 1
  185.100000 47.000000 1
  186.100000 95.000000 1
  187.100000 135.000000 1
  188.100000 185.000000 1
  189.100000 34.000000 1
  190.100000 335.000000 1
  191.100000 60.000000 1
  192.100000 8.000000 1
  193.100000 118.000000 1
  195.100000 33.000000 1
  196.100000 55.000000 1
  197.100000 62.000000 1
  198.100000 76.000000 1
  200.100000 223.000000 1
  201.100000 143.000000 1
  202.100000 596.000000 1
  203.000000 1758.000000 3
  204.000000 393.000000 1
  205.000000 178.000000 1
  206.000000 66.000000 1
  207.000000 169.000000 1
  208.000000 41.000000 1
  209.000000 76.000000 1
  210.000000 97.000000 1
  211.000000 74.000000 1
  212.000000 54.000000 1
  214.000000 41.000000 1
  216.000000 282.000000 1
  217.150000 947.000000 2
  218.100000 95871.000000 188
  219.100000 23158.000000 45
  220.100000 9362.000000 18
  221.050000 1588.000000 3
  222.100000 335.000000 1
  223.100000 18.000000 1
  224.100000 21.000000 1
  225.100000 87.000000 1
  226.100000 74.000000 1
  227.100000 114.000000 1
  228.100000 287.000000 1
  229.100000 92.000000 1
  230.100000 444.000000 1
  231.100000 188.000000 1
  232.100000 182.000000 1
  233.100000 121.000000 1
  234.100000 62.000000 1
  235.100000 31.000000 1
  236.100000 36.000000 1
  237.100000 18.000000 1
  238.100000 119.000000 1
  239.100000 27.000000 1
  240.100000 78.000000 1
  242.100000 11.000000 1
  243.100000 22.000000 1
  244.100000 127.000000 1
  245.200000 62.000000 1
  246.150000 6749.000000 13
  247.200000 1151.000000 2
  248.200000 513.000000 1
  249.200000 44.000000 1
  250.200000 57.000000 1
  251.200000 66.000000 1
  252.200000 97.000000 1
  253.200000 514.000000 1
  254.200000 105.000000 1
  255.200000 167.000000 1
  256.200000 49.000000 1
  259.200000 49.000000 1
  260.200000 258.000000 1
  261.200000 166.000000 1
  262.200000 161.000000 1
  263.200000 36.000000 1
  264.200000 151.000000 1
  265.200000 63.000000 1
  266.200000 76.000000 1
  267.200000 86.000000 1
  268.200000 36.000000 1
  269.200000 29.000000 1
  270.200000 82.000000 1
  271.200000 108.000000 1
  272.200000 55.000000 1
  275.200000 110.000000 1
  276.200000 92.000000 1
  278.200000 57.000000 1
  279.200000 54.000000 1
  280.200000 62.000000 1
  281.200000 63.000000 1
  283.200000 8.000000 1
  284.200000 36.000000 1
  285.200000 14.000000 1
  286.200000 52.000000 1
  289.200000 29.000000 1
  290.200000 55.000000 1
  291.200000 118.000000 1
  295.200000 27.000000 1
  296.200000 13.000000 1
  297.200000 66.000000 1
  298.200000 39.000000 1
  299.200000 73.000000 1
  300.200000 50.000000 1
  301.200000 97.000000 1
  303.200000 41.000000 1
  304.200000 183.000000 1
  305.200000 58.000000 1
  306.200000 105.000000 1
  307.200000 110.000000 1
  308.200000 54.000000 1
  309.200000 29.000000 1
  310.200000 130.000000 1
  311.200000 44.000000 1
  312.200000 34.000000 1
  314.200000 29.000000 1
  315.200000 65.000000 1
  317.200000 92.000000 1
  318.200000 142.000000 1
  319.200000 22.000000 1
  320.200000 100.000000 1
  321.200000 13.000000 1
  322.200000 29.000000 1
  323.200000 21.000000 1
  324.200000 71.000000 1
  325.200000 178.000000 1
  326.200000 26.000000 1
  327.200000 89.000000 1
  328.200000 11.000000 1
  329.200000 34.000000 1
  331.200000 215.000000 1
  332.200000 98.000000 1
  333.200000 14.000000 1
  335.200000 57.000000 1
  336.200000 74.000000 1
  337.200000 42.000000 1
  338.200000 95.000000 1
  339.200000 42.000000 1
  342.200000 118.000000 1
  344.200000 3.000000 1
  345.200000 57.000000 1
  346.200000 170.000000 1
  347.200000 27.000000 1
  348.200000 39.000000 1
  349.200000 24.000000 1
  350.200000 5.000000 1
  352.200000 8.000000 1
  353.200000 66.000000 1
  355.200000 164.000000 1
  356.200000 29.000000 1
  357.200000 19.000000 1
  359.200000 70.000000 1
  360.200000 62.000000 1
  362.200000 26.000000 1
  363.200000 102.000000 1
  364.200000 66.000000 1
  366.200000 57.000000 1
  368.200000 16.000000 1
  369.200000 89.000000 1
  370.200000 47.000000 1
  371.200000 24.000000 1
  373.200000 18.000000 1
  375.200000 132.000000 1
  376.200000 76.000000 1
  377.200000 89.000000 1
  379.200000 11.000000 1
  380.200000 5.000000 1
  383.200000 70.000000 1
  384.200000 95.000000 1
  387.200000 41.000000 1
  388.200000 16.000000 1
  391.200000 39.000000 1
  393.200000 71.000000 1
  394.200000 62.000000 1
  395.200000 46.000000 1
  396.200000 49.000000 1
  397.200000 60.000000 1
  398.200000 78.000000 1
  399.200000 70.000000 1
  401.200000 55.000000 1
  402.200000 14.000000 1
  403.200000 16.000000 1
  404.200000 39.000000 1
  405.200000 86.000000 1
  407.200000 50.000000 1
  408.200000 52.000000 1
  409.200000 81.000000 1
  410.200000 44.000000 1
  411.200000 135.000000 1
  412.200000 27.000000 1
  414.200000 44.000000 1
  415.200000 24.000000 1
  416.200000 36.000000 1
  417.200000 27.000000 1
  418.200000 44.000000 1
  419.200000 114.000000 1
  420.200000 18.000000 1
  422.200000 71.000000 1
  424.200000 36.000000 1
  426.200000 22.000000 1
  427.200000 50.000000 1
  428.200000 34.000000 1
  429.200000 47.000000 1
  430.200000 135.000000 1
  432.200000 27.000000 1
  433.200000 57.000000 1
  434.200000 79.000000 1
  435.200000 62.000000 1
  436.200000 118.000000 1
  437.200000 54.000000 1
  438.200000 81.000000 1
  439.200000 62.000000 1
  440.200000 98.000000 1
  441.200000 66.000000 1
  442.200000 8.000000 1
  443.200000 52.000000 1
  444.200000 65.000000 1
  445.200000 98.000000 1
  446.200000 31.000000 1
  447.200000 58.000000 1
  448.200000 95.000000 1
  449.200000 97.000000 1
  450.200000 66.000000 1
  451.200000 2.000000 1
  452.200000 71.000000 1
  453.200000 21.000000 1
  454.200000 65.000000 1
  455.200000 29.000000 1
  459.200000 30.000000 1
  460.200000 33.000000 1
  461.200000 26.000000 1
  462.200000 34.000000 1
  464.200000 118.000000 1
  465.200000 60.000000 1
  466.200000 22.000000 1
  468.200000 73.000000 1
  469.200000 68.000000 1
  470.200000 46.000000 1
  471.200000 33.000000 1
  472.200000 50.000000 1
  473.200000 30.000000 1
  474.200000 29.000000 1
  476.200000 49.000000 1
  477.200000 22.000000 1
  478.200000 21.000000 1
  479.200000 41.000000 1
  480.200000 127.000000 1
  482.200000 98.000000 1
  484.200000 50.000000 1
  485.200000 44.000000 1
  486.200000 33.000000 1
  489.200000 42.000000 1
  490.200000 95.000000 1
  491.200000 68.000000 1
  492.200000 57.000000 1
  493.200000 66.000000 1
  494.200000 27.000000 1
  495.200000 46.000000 1
  496.200000 33.000000 1
  497.200000 18.000000 1
  498.200000 84.000000 1
  499.200000 42.000000 1