ACCESSION: MSBNK-GL_Sciences_Inc-GLS00028
RECORD_TITLE: N-Acetyl-L-Leucine; EI-B; MS; 1 TMS; RT: 549.15 s
DATE: 2016.01.19 (Created 2012.08.03, modified 2013.07.31)
AUTHORS: Miyagawa H, Akimoto S, Yamasaki K, GL Sciences Inc.
LICENSE: CC BY-SA
COPYRIGHT: GL Sciences Inc.
COMMENT: The chemical compound was chemically modified with N-methyl-N-trimethylsilyl-trifluoroacetamide(MSTFA) before GC-MS analysis. When it has two or more functional groups, this modification gave a mixture of the TMS derivatives having different number of TMS groups at different functional groups.

CH$NAME: N-Acetyl-L-Leucine
CH$COMPOUND_CLASS: Natural Product
CH$FORMULA: C8H15NO3
CH$EXACT_MASS: 173.10519
CH$SMILES: CC(C)C[C@H](NC(C)=O)C(O)=O
CH$IUPAC: InChI=1S/C8H15NO3/c1-5(2)4-7(8(11)12)9-6(3)10/h5,7H,4H2,1-3H3,(H,9,10)(H,11,12)/t7-/m0/s1
CH$LINK: CAS 1188-21-2
CH$LINK: CHEBI 17786
CH$LINK: KEGG C02710
CH$LINK: PUBCHEM 5673
CH$LINK: INCHIKEY WXNXCEHXYPACJF-ZETCQYMHSA-N
CH$LINK: COMPTOX DTXSID6045870

AC$INSTRUMENT: GCMS-2010 Plus, Shimadzu
AC$INSTRUMENT_TYPE: EI-B
AC$MASS_SPECTROMETRY: MS_TYPE MS
AC$MASS_SPECTROMETRY: ION_MODE POSITIVE
AC$MASS_SPECTROMETRY: GAS_PRESSURE 75 kPa
AC$MASS_SPECTROMETRY: ION_SOURCE_TEMPERATURE 200 C
AC$MASS_SPECTROMETRY: SCAN_RANGE_M/Z 85-500
AC$CHROMATOGRAPHY: COLUMN_NAME InertCap 5MS/NP 0.25 mmI.D. x 30 m, df=0.25 um
AC$CHROMATOGRAPHY: INJECTION_TEMPERATURE 230 C
AC$CHROMATOGRAPHY: OVEN_TEMPERATURE 80 C(2 min)-15 C/min - 330C
AC$CHROMATOGRAPHY: RETENTION_INDEX 1444
AC$CHROMATOGRAPHY: RETENTION_TIME 549.15
AC$CHROMATOGRAPHY: TRANSFARLINE_TEMPERATURE 250 C

MS$FOCUSED_ION: DERIVATIVE_TYPE 1 TMS
MS$DATA_PROCESSING: WHOLE GCMSsolution

PK$SPLASH: splash10-000i-6910000000-4832dfe7d6d4267d6e52
PK$NUM_PEAK: 377
PK$PEAK: m/z int. rel.int.
  86.100000 674756.000000 999
  87.100000 43369.000000 64
  88.100000 2778.000000 4
  89.050000 5588.000000 8
  90.100000 897.000000 1
  91.100000 3804.000000 6
  92.100000 682.000000 1
  92.700000 356.000000 1
  93.650000 1258.000000 2
  95.050000 2560.000000 4
  96.050000 6715.000000 10
  97.100000 4914.000000 7
  98.050000 1869.000000 3
  99.050000 40631.000000 60
  100.050000 17308.000000 26
  101.100000 3881.000000 6
  102.100000 4898.000000 7
  103.050000 4201.000000 6
  104.100000 6878.000000 10
  105.100000 1236.000000 2
  106.100000 398.000000 1
  107.100000 68.000000 1
  108.100000 199.000000 1
  109.100000 134.000000 1
  110.150000 1424.000000 2
  111.150000 1921.000000 3
  112.100000 23119.000000 34
  113.100000 3223.000000 5
  114.100000 2324.000000 3
  115.150000 2220.000000 3
  116.100000 63986.000000 95
  117.050000 17806.000000 26
  118.100000 5638.000000 8
  119.050000 1230.000000 2
  120.100000 266.000000 1
  121.100000 166.000000 1
  122.100000 207.000000 1
  123.100000 129.000000 1
  124.100000 441.000000 1
  125.100000 1689.000000 3
  126.150000 3677.000000 5
  127.150000 10042.000000 15
  128.150000 324566.000000 481
  129.100000 39007.000000 58
  130.050000 19447.000000 29
  131.100000 8634.000000 13
  132.100000 3434.000000 5
  133.100000 1060.000000 2
  134.100000 818.000000 1
  135.100000 362.000000 1
  136.100000 185.000000 1
  137.100000 60.000000 1
  138.100000 58.000000 1
  139.100000 217.000000 1
  140.150000 5061.000000 7
  141.100000 766.000000 1
  142.100000 21954.000000 33
  143.100000 4567.000000 7
  144.100000 6657.000000 10
  145.150000 10312.000000 15
  146.100000 33602.000000 50
  147.150000 9079.000000 13
  148.100000 1959.000000 3
  149.100000 478.000000 1
  150.100000 90.000000 1
  151.100000 33.000000 1
  152.100000 66.000000 1
  153.100000 678.000000 1
  154.150000 849.000000 1
  155.100000 6513.000000 10
  156.150000 2122.000000 3
  157.150000 1038.000000 2
  158.150000 196976.000000 292
  159.100000 26681.000000 40
  160.100000 22225.000000 33
  161.150000 3088.000000 5
  162.100000 783.000000 1
  163.100000 100.000000 1
  164.100000 41.000000 1
  165.100000 130.000000 1
  166.100000 65.000000 1
  167.100000 73.000000 1
  168.100000 100.000000 1
  169.100000 796.000000 1
  170.100000 2793.000000 4
  171.100000 19756.000000 29
  172.050000 3983.000000 6
  173.100000 2807.000000 4
  174.100000 22778.000000 34
  175.100000 4444.000000 7
  176.100000 1772.000000 3
  177.100000 404.000000 1
  178.100000 223.000000 1
  179.100000 202.000000 1
  180.100000 27.000000 1
  181.100000 118.000000 1
  182.100000 70.000000 1
  183.100000 70.000000 1
  184.150000 1857.000000 3
  185.100000 810.000000 1
  186.100000 4694.000000 7
  187.150000 823.000000 1
  188.050000 15988.000000 24
  189.050000 17965.000000 27
  190.100000 2671.000000 4
  191.100000 895.000000 1
  192.100000 178.000000 1
  193.100000 98.000000 1
  194.100000 65.000000 1
  195.100000 127.000000 1
  196.100000 97.000000 1
  197.100000 130.000000 1
  198.100000 22.000000 1
  199.100000 121.000000 1
  200.100000 868.000000 1
  201.150000 17090.000000 25
  202.100000 8121.000000 12
  203.100000 1777.000000 3
  204.100000 444.000000 1
  205.100000 140.000000 1
  206.000000 27.000000 1
  206.950000 2436.000000 4
  208.000000 535.000000 1
  209.000000 390.000000 1
  210.000000 230.000000 1
  211.000000 76.000000 1
  212.000000 142.000000 1
  213.000000 146.000000 1
  214.000000 132.000000 1
  215.000000 106.000000 1
  216.000000 60.000000 1
  217.000000 21.000000 1
  218.000000 65.000000 1
  219.000000 862.000000 1
  220.000000 79.000000 1
  221.000000 170.000000 1
  222.000000 167.000000 1
  223.000000 68.000000 1
  224.000000 79.000000 1
  225.000000 42.000000 1
  226.000000 108.000000 1
  227.000000 164.000000 1
  228.000000 116.000000 1
  229.100000 692.000000 1
  230.100000 137199.000000 203
  231.100000 20783.000000 31
  232.100000 7166.000000 11
  233.100000 887.000000 1
  234.100000 97.000000 1
  235.100000 135.000000 1
  237.100000 66.000000 1
  239.100000 111.000000 1
  241.100000 66.000000 1
  243.100000 90.000000 1
  244.100000 239.000000 1
  245.150000 2758.000000 4
  246.100000 1207.000000 2
  247.100000 239.000000 1
  248.100000 137.000000 1
  249.100000 124.000000 1
  250.100000 60.000000 1
  251.100000 78.000000 1
  253.100000 644.000000 1
  254.100000 230.000000 1
  255.100000 170.000000 1
  256.100000 50.000000 1
  257.100000 33.000000 1
  258.100000 110.000000 1
  259.100000 27.000000 1
  261.100000 44.000000 1
  262.100000 130.000000 1
  264.100000 162.000000 1
  265.100000 169.000000 1
  266.100000 145.000000 1
  267.100000 182.000000 1
  268.100000 98.000000 1
  269.100000 81.000000 1
  270.100000 137.000000 1
  273.100000 135.000000 1
  274.100000 665.000000 1
  275.100000 183.000000 1
  276.100000 110.000000 1
  277.100000 92.000000 1
  278.100000 122.000000 1
  279.100000 175.000000 1
  280.100000 30.000000 1
  281.100000 153.000000 1
  282.100000 16.000000 1
  283.100000 70.000000 1
  284.100000 154.000000 1
  285.100000 58.000000 1
  286.100000 143.000000 1
  287.100000 42.000000 1
  288.100000 14.000000 1
  289.100000 49.000000 1
  290.100000 78.000000 1
  292.100000 156.000000 1
  294.100000 103.000000 1
  295.100000 79.000000 1
  296.100000 114.000000 1
  297.100000 6.000000 1
  298.100000 87.000000 1
  299.100000 44.000000 1
  300.100000 71.000000 1
  301.100000 22.000000 1
  302.100000 106.000000 1
  303.100000 18.000000 1
  304.100000 84.000000 1
  305.100000 31.000000 1
  307.100000 265.000000 1
  308.100000 140.000000 1
  309.100000 465.000000 1
  310.100000 22.000000 1
  311.100000 92.000000 1
  312.100000 137.000000 1
  313.100000 126.000000 1
  314.100000 110.000000 1
  315.100000 185.000000 1
  316.100000 50.000000 1
  317.100000 90.000000 1
  318.100000 188.000000 1
  319.100000 148.000000 1
  320.100000 143.000000 1
  321.100000 71.000000 1
  322.100000 19.000000 1
  323.100000 16.000000 1
  324.100000 81.000000 1
  325.100000 158.000000 1
  326.100000 30.000000 1
  327.100000 441.000000 1
  328.100000 166.000000 1
  329.100000 239.000000 1
  331.100000 161.000000 1
  332.100000 58.000000 1
  333.100000 34.000000 1
  334.100000 68.000000 1
  335.100000 153.000000 1
  336.100000 102.000000 1
  337.100000 46.000000 1
  338.100000 114.000000 1
  339.100000 76.000000 1
  340.100000 46.000000 1
  341.100000 38.000000 1
  342.100000 58.000000 1
  343.100000 76.000000 1
  344.100000 62.000000 1
  345.100000 39.000000 1
  346.100000 143.000000 1
  347.100000 94.000000 1
  348.100000 27.000000 1
  349.100000 60.000000 1
  350.100000 119.000000 1
  351.100000 13.000000 1
  352.100000 90.000000 1
  357.100000 130.000000 1
  358.100000 78.000000 1
  360.100000 19.000000 1
  361.100000 68.000000 1
  363.100000 38.000000 1
  364.100000 95.000000 1
  365.100000 87.000000 1
  366.100000 98.000000 1
  367.100000 52.000000 1
  368.100000 74.000000 1
  369.100000 39.000000 1
  370.100000 81.000000 1
  371.100000 95.000000 1
  373.100000 73.000000 1
  374.100000 16.000000 1
  375.100000 38.000000 1
  376.100000 79.000000 1
  377.100000 16.000000 1
  378.100000 73.000000 1
  381.100000 78.000000 1
  382.100000 60.000000 1
  383.100000 127.000000 1
  384.100000 66.000000 1
  385.100000 22.000000 1
  386.100000 55.000000 1
  387.100000 34.000000 1
  388.100000 159.000000 1
  389.100000 65.000000 1
  390.100000 34.000000 1
  391.100000 89.000000 1
  392.100000 14.000000 1
  393.100000 58.000000 1
  394.100000 76.000000 1
  395.100000 13.000000 1
  396.100000 33.000000 1
  397.100000 79.000000 1
  398.100000 98.000000 1
  399.100000 46.000000 1
  400.100000 49.000000 1
  401.100000 11.000000 1
  402.100000 36.000000 1
  403.100000 162.000000 1
  404.100000 71.000000 1
  405.100000 52.000000 1
  406.100000 3.000000 1
  407.100000 76.000000 1
  408.100000 116.000000 1
  409.100000 58.000000 1
  410.100000 30.000000 1
  411.100000 22.000000 1
  412.100000 36.000000 1
  413.100000 30.000000 1
  414.100000 66.000000 1
  415.100000 34.000000 1
  416.100000 98.000000 1
  417.100000 98.000000 1
  418.100000 27.000000 1
  419.100000 39.000000 1
  420.100000 62.000000 1
  421.100000 79.000000 1
  422.100000 33.000000 1
  423.100000 62.000000 1
  425.100000 63.000000 1
  426.100000 66.000000 1
  427.100000 60.000000 1
  428.100000 74.000000 1
  429.100000 92.000000 1
  430.100000 34.000000 1
  431.100000 41.000000 1
  432.100000 87.000000 1
  433.100000 49.000000 1
  434.100000 62.000000 1
  436.100000 71.000000 1
  437.100000 65.000000 1
  438.100000 18.000000 1
  439.100000 62.000000 1
  440.100000 58.000000 1
  441.100000 97.000000 1
  442.100000 89.000000 1
  444.100000 57.000000 1
  445.100000 21.000000 1
  446.100000 76.000000 1
  447.100000 86.000000 1
  448.100000 100.000000 1
  449.100000 100.000000 1
  450.100000 57.000000 1
  451.100000 11.000000 1
  452.100000 36.000000 1
  453.100000 36.000000 1
  456.100000 65.000000 1
  457.100000 31.000000 1
  458.100000 14.000000 1
  459.100000 44.000000 1
  460.100000 29.000000 1
  461.100000 47.000000 1
  462.100000 126.000000 1
  463.100000 58.000000 1
  465.100000 24.000000 1
  466.100000 5.000000 1
  467.100000 33.000000 1
  468.100000 29.000000 1
  469.100000 10.000000 1
  470.100000 34.000000 1
  472.100000 90.000000 1
  473.100000 114.000000 1
  474.100000 16.000000 1
  475.100000 110.000000 1
  476.100000 50.000000 1
  477.100000 31.000000 1
  478.100000 54.000000 1
  479.100000 30.000000 1
  480.100000 11.000000 1
  481.100000 29.000000 1
  482.100000 62.000000 1
  483.100000 95.000000 1
  485.100000 50.000000 1
  487.100000 8.000000 1
  489.100000 66.000000 1
  491.100000 84.000000 1
  492.100000 108.000000 1
  495.100000 22.000000 1
  498.100000 30.000000 1
  499.100000 13.000000 1