ACCESSION: MSBNK-GL_Sciences_Inc-GLS00031
RECORD_TITLE: L-Glutamic acid; EI-B; MS; 3 TMS; RT: 647.97 s
DATE: 2016.01.19 (Created 2012.08.03, modified 2013.07.31)
AUTHORS: Miyagawa H, Akimoto S, Yamasaki K, GL Sciences Inc.
LICENSE: CC BY-SA
COPYRIGHT: GL Sciences Inc.
COMMENT: The chemical compound was chemically modified with N-methyl-N-trimethylsilyl-trifluoroacetamide(MSTFA) before GC-MS analysis. When it has two or more functional groups, this modification gave a mixture of the TMS derivatives having different number of TMS groups at different functional groups.

CH$NAME: L-Glutamic acid
CH$COMPOUND_CLASS: Natural Product
CH$FORMULA: C5H9NO4
CH$EXACT_MASS: 147.05316
CH$SMILES: OC(=O)CC[C@H](N)C(O)=O
CH$IUPAC: InChI=1S/C5H9NO4/c6-3(5(9)10)1-2-4(7)8/h3H,1-2,6H2,(H,7,8)(H,9,10)/t3-/m0/s1
CH$LINK: CAS 56-86-0
CH$LINK: CHEBI 16015
CH$LINK: KEGG C00025
CH$LINK: PUBCHEM 3327
CH$LINK: INCHIKEY WHUUTDBJXJRKMK-VKHMYHEASA-N
CH$LINK: COMPTOX DTXSID5020659

AC$INSTRUMENT: GCMS-2010 Plus, Shimadzu
AC$INSTRUMENT_TYPE: EI-B
AC$MASS_SPECTROMETRY: MS_TYPE MS
AC$MASS_SPECTROMETRY: ION_MODE POSITIVE
AC$MASS_SPECTROMETRY: GAS_PRESSURE 75 kPa
AC$MASS_SPECTROMETRY: ION_SOURCE_TEMPERATURE 200 C
AC$MASS_SPECTROMETRY: SCAN_RANGE_M/Z 85-500
AC$CHROMATOGRAPHY: COLUMN_NAME InertCap 5MS/NP 0.25 mmI.D. x 30 m, df=0.25 um
AC$CHROMATOGRAPHY: INJECTION_TEMPERATURE 230 C
AC$CHROMATOGRAPHY: OVEN_TEMPERATURE 80 C(2 min)-15 C/min - 330C
AC$CHROMATOGRAPHY: RETENTION_INDEX 1630
AC$CHROMATOGRAPHY: RETENTION_TIME 647.97
AC$CHROMATOGRAPHY: TRANSFARLINE_TEMPERATURE 250 C

MS$FOCUSED_ION: DERIVATIVE_TYPE 3 TMS
MS$DATA_PROCESSING: WHOLE GCMSsolution

PK$SPLASH: splash10-0002-0790000000-79d3e289c22cb183faa1
PK$NUM_PEAK: 391
PK$PEAK: m/z int. rel.int.
  86.100000 5641.000000 10
  87.000000 2514.000000 4
  88.000000 1238.000000 2
  89.050000 1787.000000 3
  90.000000 782.000000 1
  91.000000 759.000000 1
  92.000000 97.000000 1
  93.000000 348.000000 1
  94.000000 305.000000 1
  95.000000 1199.000000 2
  96.000000 1234.000000 2
  97.100000 1006.000000 2
  98.100000 3918.000000 7
  99.100000 4086.000000 7
  100.100000 45678.000000 80
  101.100000 8121.000000 14
  102.100000 4369.000000 8
  103.050000 5162.000000 9
  104.100000 1012.000000 2
  105.050000 1099.000000 2
  106.100000 156.000000 1
  107.100000 159.000000 1
  108.100000 193.000000 1
  109.100000 223.000000 1
  110.100000 719.000000 1
  111.100000 617.000000 1
  112.100000 5422.000000 9
  113.050000 8439.000000 15
  114.100000 10567.000000 18
  115.100000 9657.000000 17
  116.100000 4474.000000 8
  117.100000 7666.000000 13
  118.050000 1464.000000 3
  119.050000 2341.000000 4
  120.000000 401.000000 1
  121.000000 382.000000 1
  122.000000 276.000000 1
  123.000000 138.000000 1
  124.000000 490.000000 1
  125.000000 370.000000 1
  126.100000 1418.000000 2
  127.150000 1540.000000 3
  128.100000 217916.000000 380
  129.100000 37881.000000 66
  130.100000 15258.000000 27
  131.100000 12599.000000 22
  132.050000 8348.000000 15
  133.050000 23900.000000 42
  134.100000 4009.000000 7
  135.050000 2802.000000 5
  136.100000 270.000000 1
  137.100000 146.000000 1
  138.100000 66.000000 1
  139.100000 332.000000 1
  140.100000 20534.000000 36
  141.100000 2818.000000 5
  142.150000 1965.000000 3
  143.100000 2095.000000 4
  144.100000 1759.000000 3
  145.150000 1663.000000 3
  146.150000 1801.000000 3
  147.150000 132252.000000 230
  148.150000 22552.000000 39
  149.100000 21879.000000 38
  150.100000 2601.000000 5
  151.100000 1404.000000 2
  152.100000 209.000000 1
  153.100000 210.000000 1
  154.100000 1596.000000 3
  155.150000 2102.000000 4
  156.150000 130143.000000 227
  157.100000 23175.000000 40
  158.100000 21358.000000 37
  159.100000 3860.000000 7
  160.050000 2044.000000 4
  161.000000 846.000000 1
  162.000000 938.000000 2
  163.150000 2531.000000 4
  164.100000 777.000000 1
  165.100000 230.000000 1
  166.100000 246.000000 1
  168.000000 1103.000000 2
  169.000000 468.000000 1
  170.000000 812.000000 1
  171.000000 302.000000 1
  172.050000 2954.000000 5
  173.100000 1970.000000 3
  174.100000 10214.000000 18
  175.050000 1932.000000 3
  176.100000 1386.000000 2
  177.100000 858.000000 1
  178.100000 220.000000 1
  179.100000 252.000000 1
  180.100000 68.000000 1
  181.100000 47.000000 1
  182.100000 286.000000 1
  183.100000 228.000000 1
  184.100000 1042.000000 2
  185.000000 430.000000 1
  186.050000 2902.000000 5
  187.000000 550.000000 1
  188.050000 1924.000000 3
  189.050000 2287.000000 4
  190.050000 1070.000000 2
  191.000000 1114.000000 2
  192.000000 244.000000 1
  193.000000 140.000000 1
  194.000000 18.000000 1
  195.000000 113.000000 1
  196.000000 29.000000 1
  197.000000 198.000000 1
  198.000000 567.000000 1
  199.000000 198.000000 1
  200.000000 543.000000 1
  201.100000 636.000000 1
  202.100000 6817.000000 12
  203.100000 3703.000000 6
  204.050000 24198.000000 42
  205.050000 5361.000000 9
  206.050000 2964.000000 5
  207.000000 3162.000000 6
  208.000000 854.000000 1
  209.000000 287.000000 1
  210.000000 105.000000 1
  211.000000 106.000000 1
  212.000000 180.000000 1
  213.100000 156.000000 1
  214.100000 7646.000000 13
  215.100000 1719.000000 3
  216.100000 3057.000000 5
  217.150000 1027.000000 2
  218.050000 26185.000000 46
  219.100000 7262.000000 13
  220.050000 2414.000000 4
  221.050000 11085.000000 19
  222.100000 2017.000000 4
  223.000000 1206.000000 2
  224.000000 113.000000 1
  225.000000 167.000000 1
  226.000000 108.000000 1
  227.000000 68.000000 1
  228.000000 495.000000 1
  229.150000 1859.000000 3
  230.100000 92041.000000 160
  231.050000 19834.000000 35
  232.100000 9692.000000 17
  233.000000 1460.000000 3
  234.000000 348.000000 1
  235.000000 13.000000 1
  236.000000 42.000000 1
  238.000000 65.000000 1
  239.000000 58.000000 1
  240.000000 346.000000 1
  241.000000 188.000000 1
  242.000000 420.000000 1
  243.000000 90.000000 1
  244.100000 2311.000000 4
  245.150000 12870.000000 22
  246.100000 573294.000000 999
  247.150000 129463.000000 226
  248.100000 54810.000000 96
  249.100000 7663.000000 13
  250.100000 1631.000000 3
  251.100000 268.000000 1
  252.100000 119.000000 1
  253.100000 142.000000 1
  254.100000 27.000000 1
  255.100000 95.000000 1
  256.100000 145.000000 1
  257.100000 231.000000 1
  258.100000 18119.000000 32
  259.050000 4182.000000 7
  260.050000 1979.000000 3
  261.000000 383.000000 1
  262.000000 70.000000 1
  263.000000 14.000000 1
  264.000000 258.000000 1
  265.000000 166.000000 1
  266.000000 41.000000 1
  267.000000 183.000000 1
  268.000000 110.000000 1
  269.000000 113.000000 1
  270.000000 98.000000 1
  271.000000 57.000000 1
  272.000000 785.000000 1
  273.100000 1778.000000 3
  274.100000 6754.000000 12
  275.100000 1671.000000 3
  276.100000 1834.000000 3
  277.100000 233.000000 1
  278.100000 212.000000 1
  279.100000 177.000000 1
  280.100000 66.000000 1
  281.100000 225.000000 1
  282.100000 138.000000 1
  283.100000 142.000000 1
  284.100000 84.000000 1
  285.100000 177.000000 1
  286.100000 142.000000 1
  287.100000 52.000000 1
  288.100000 220.000000 1
  289.100000 65.000000 1
  290.100000 169.000000 1
  291.100000 263.000000 1
  292.100000 198.000000 1
  293.100000 121.000000 1
  294.100000 106.000000 1
  296.100000 13.000000 1
  297.100000 13.000000 1
  298.100000 34.000000 1
  299.100000 49.000000 1
  300.100000 16.000000 1
  301.100000 97.000000 1
  302.100000 127.000000 1
  303.100000 113.000000 1
  304.100000 402.000000 1
  305.100000 142.000000 1
  306.100000 156.000000 1
  307.100000 167.000000 1
  308.100000 166.000000 1
  309.100000 514.000000 1
  310.100000 21.000000 1
  312.100000 124.000000 1
  313.100000 102.000000 1
  314.100000 106.000000 1
  316.100000 31.000000 1
  317.100000 26.000000 1
  318.100000 73.000000 1
  319.100000 62.000000 1
  320.150000 5689.000000 10
  321.050000 1480.000000 3
  322.150000 948.000000 2
  323.100000 134.000000 1
  324.100000 172.000000 1
  325.100000 30.000000 1
  326.100000 5.000000 1
  327.100000 174.000000 1
  328.100000 234.000000 1
  329.100000 134.000000 1
  330.100000 831.000000 1
  331.100000 468.000000 1
  332.150000 1435.000000 3
  333.100000 351.000000 1
  334.100000 226.000000 1
  335.100000 164.000000 1
  336.100000 87.000000 1
  337.100000 3.000000 1
  338.100000 41.000000 1
  339.100000 82.000000 1
  340.100000 65.000000 1
  341.100000 62.000000 1
  343.100000 46.000000 1
  344.100000 60.000000 1
  345.100000 14.000000 1
  346.100000 302.000000 1
  347.100000 382.000000 1
  348.150000 35345.000000 62
  349.100000 10497.000000 18
  350.100000 5257.000000 9
  351.100000 1300.000000 2
  352.100000 351.000000 1
  353.100000 134.000000 1
  354.100000 81.000000 1
  355.100000 57.000000 1
  356.100000 119.000000 1
  357.100000 114.000000 1
  358.100000 110.000000 1
  359.100000 42.000000 1
  360.100000 71.000000 1
  361.100000 33.000000 1
  362.100000 214.000000 1
  363.150000 20006.000000 35
  364.150000 7364.000000 13
  365.150000 3503.000000 6
  366.100000 686.000000 1
  367.100000 233.000000 1
  368.100000 151.000000 1
  369.100000 39.000000 1
  370.100000 14.000000 1
  371.100000 92.000000 1
  372.100000 58.000000 1
  373.100000 41.000000 1
  374.100000 92.000000 1
  375.100000 46.000000 1
  376.100000 8.000000 1
  377.100000 34.000000 1
  378.100000 71.000000 1
  379.100000 8.000000 1
  380.100000 86.000000 1
  381.100000 8.000000 1
  382.100000 44.000000 1
  383.100000 74.000000 1
  384.100000 81.000000 1
  385.100000 108.000000 1
  387.100000 62.000000 1
  388.100000 11.000000 1
  389.100000 55.000000 1
  390.100000 62.000000 1
  391.100000 46.000000 1
  392.100000 10.000000 1
  393.100000 94.000000 1
  394.100000 71.000000 1
  396.100000 38.000000 1
  397.100000 58.000000 1
  398.100000 89.000000 1
  399.100000 81.000000 1
  400.100000 27.000000 1
  401.100000 14.000000 1
  402.100000 87.000000 1
  403.100000 116.000000 1
  404.100000 110.000000 1
  405.100000 44.000000 1
  406.100000 33.000000 1
  407.100000 54.000000 1
  408.100000 95.000000 1
  409.100000 130.000000 1
  410.100000 66.000000 1
  412.100000 26.000000 1
  413.100000 8.000000 1
  414.100000 87.000000 1
  415.100000 34.000000 1
  418.100000 38.000000 1
  419.100000 127.000000 1
  420.100000 86.000000 1
  421.100000 79.000000 1
  422.100000 44.000000 1
  423.100000 55.000000 1
  424.100000 36.000000 1
  425.100000 52.000000 1
  426.100000 52.000000 1
  428.100000 8.000000 1
  429.100000 19.000000 1
  430.100000 3.000000 1
  431.100000 138.000000 1
  432.100000 86.000000 1
  434.100000 18.000000 1
  435.100000 16.000000 1
  436.100000 92.000000 1
  437.100000 63.000000 1
  438.100000 57.000000 1
  439.100000 42.000000 1
  441.100000 76.000000 1
  442.100000 27.000000 1
  443.100000 5.000000 1
  444.100000 66.000000 1
  445.100000 106.000000 1
  446.100000 94.000000 1
  447.100000 31.000000 1
  448.100000 44.000000 1
  449.100000 30.000000 1
  450.100000 36.000000 1
  451.100000 52.000000 1
  453.100000 78.000000 1
  454.100000 55.000000 1
  455.100000 22.000000 1
  456.100000 46.000000 1
  457.100000 57.000000 1
  459.100000 26.000000 1
  461.100000 151.000000 1
  462.100000 44.000000 1
  463.100000 100.000000 1
  464.100000 68.000000 1
  466.100000 24.000000 1
  467.100000 55.000000 1
  468.100000 65.000000 1
  470.100000 6.000000 1
  471.100000 52.000000 1
  472.100000 8.000000 1
  473.100000 132.000000 1
  474.100000 27.000000 1
  476.100000 87.000000 1
  477.100000 94.000000 1
  478.100000 79.000000 1
  479.100000 106.000000 1
  481.100000 95.000000 1
  482.100000 94.000000 1
  483.100000 98.000000 1
  484.100000 54.000000 1
  485.100000 86.000000 1
  486.100000 21.000000 1
  487.100000 31.000000 1
  488.100000 68.000000 1
  490.100000 29.000000 1
  491.100000 113.000000 1
  492.100000 6.000000 1
  493.100000 49.000000 1
  494.100000 94.000000 1
  496.100000 16.000000 1
  497.100000 127.000000 1
  498.100000 129.000000 1
  499.100000 135.000000 1