ACCESSION: MSBNK-GL_Sciences_Inc-GLS00037
RECORD_TITLE: L-(-)-Threonine; EI-B; MS; 3 TMS; RT: 523.50 s
DATE: 2016.01.19 (Created 2012.08.03, modified 2013.07.31)
AUTHORS: Miyagawa H, Akimoto S, Yamasaki K, GL Sciences Inc.
LICENSE: CC BY-SA
COPYRIGHT: GL Sciences Inc.
COMMENT: The chemical compound was chemically modified with N-methyl-N-trimethylsilyl-trifluoroacetamide(MSTFA) before GC-MS analysis. When it has two or more functional groups, this modification gave a mixture of the TMS derivatives having different number of TMS groups at different functional groups.

CH$NAME: L-(-)-Threonine
CH$COMPOUND_CLASS: Natural Product
CH$FORMULA: C4H9NO3
CH$EXACT_MASS: 119.05824
CH$SMILES: CC(O)C(N)C(O)=O
CH$IUPAC: InChI=1S/C4H9NO3/c1-2(6)3(5)4(7)8/h2-3,6H,5H2,1H3,(H,7,8)/t2-,3+/m1/s1
CH$LINK: CAS 72-19-5
CH$LINK: CHEBI 16857
CH$LINK: KEGG C00188
CH$LINK: PUBCHEM 3488
CH$LINK: INCHIKEY AYFVYJQAPQTCCC-GBXIJSLDSA-N
CH$LINK: COMPTOX DTXSID2046412

AC$INSTRUMENT: GCMS-2010 Plus, Shimadzu
AC$INSTRUMENT_TYPE: EI-B
AC$MASS_SPECTROMETRY: MS_TYPE MS
AC$MASS_SPECTROMETRY: ION_MODE POSITIVE
AC$MASS_SPECTROMETRY: GAS_PRESSURE 75 kPa
AC$MASS_SPECTROMETRY: ION_SOURCE_TEMPERATURE 200 C
AC$MASS_SPECTROMETRY: SCAN_RANGE_M/Z 85-500
AC$CHROMATOGRAPHY: COLUMN_NAME InertCap 5MS/NP 0.25 mmI.D. x 30 m, df=0.25 um
AC$CHROMATOGRAPHY: INJECTION_TEMPERATURE 230 C
AC$CHROMATOGRAPHY: OVEN_TEMPERATURE 80 C(2 min)-15 C/min - 330C
AC$CHROMATOGRAPHY: RETENTION_INDEX 1399
AC$CHROMATOGRAPHY: RETENTION_TIME 523.50
AC$CHROMATOGRAPHY: TRANSFARLINE_TEMPERATURE 250 C

MS$FOCUSED_ION: DERIVATIVE_TYPE 3 TMS
MS$DATA_PROCESSING: WHOLE GCMSsolution

PK$SPLASH: splash10-014i-0980000000-ebba7965f95f804648ab
PK$NUM_PEAK: 371
PK$PEAK: m/z int. rel.int.
  86.050000 13135.000000 44
  87.000000 13415.000000 45
  88.000000 2154.000000 7
  89.000000 1038.000000 3
  90.000000 265.000000 1
  91.000000 338.000000 1
  93.000000 142.000000 1
  94.000000 73.000000 1
  95.000000 297.000000 1
  96.000000 441.000000 1
  97.000000 782.000000 3
  98.050000 2452.000000 8
  99.150000 2650.000000 9
  100.100000 73294.000000 246
  101.050000 157083.000000 527
  102.100000 22434.000000 75
  103.050000 12034.000000 40
  104.100000 1015.000000 3
  105.050000 1298.000000 4
  106.000000 310.000000 1
  107.000000 94.000000 1
  108.000000 118.000000 1
  109.000000 62.000000 1
  110.000000 268.000000 1
  111.000000 498.000000 2
  112.100000 2766.000000 9
  113.100000 1463.000000 5
  114.100000 15010.000000 50
  115.050000 8832.000000 30
  116.150000 5005.000000 17
  117.100000 254393.000000 854
  118.100000 27241.000000 91
  119.100000 13754.000000 46
  120.100000 1225.000000 4
  121.100000 263.000000 1
  122.100000 79.000000 1
  123.100000 21.000000 1
  124.100000 90.000000 1
  125.100000 206.000000 1
  126.100000 585.000000 2
  127.150000 1079.000000 4
  128.100000 70108.000000 235
  129.100000 72766.000000 244
  130.100000 28286.000000 95
  131.100000 30153.000000 101
  132.050000 21529.000000 72
  133.050000 26349.000000 88
  134.050000 4615.000000 15
  135.050000 2829.000000 9
  136.100000 377.000000 1
  137.100000 140.000000 1
  138.100000 94.000000 1
  139.100000 49.000000 1
  140.100000 460.000000 2
  141.100000 249.000000 1
  142.050000 1131.000000 4
  143.100000 722.000000 2
  144.100000 3385.000000 11
  145.100000 1273.000000 4
  146.150000 5123.000000 17
  147.100000 104953.000000 352
  148.100000 17434.000000 59
  149.100000 10271.000000 34
  150.100000 1234.000000 4
  151.100000 249.000000 1
  152.100000 106.000000 1
  153.100000 8.000000 1
  154.100000 250.000000 1
  155.100000 121.000000 1
  156.100000 2406.000000 8
  157.100000 1102.000000 4
  158.100000 4564.000000 15
  159.100000 7855.000000 26
  160.050000 5408.000000 18
  161.050000 2055.000000 7
  162.100000 700.000000 2
  163.100000 4562.000000 15
  164.100000 754.000000 3
  165.100000 521.000000 2
  166.100000 234.000000 1
  167.100000 63.000000 1
  169.100000 164.000000 1
  170.100000 276.000000 1
  171.100000 214.000000 1
  172.100000 4538.000000 15
  173.150000 1041.000000 3
  174.100000 5530.000000 19
  175.050000 1466.000000 5
  176.100000 2548.000000 9
  177.050000 1851.000000 6
  178.000000 470.000000 2
  179.000000 124.000000 1
  180.000000 231.000000 1
  181.000000 169.000000 1
  182.000000 46.000000 1
  183.000000 130.000000 1
  184.000000 166.000000 1
  185.000000 159.000000 1
  186.050000 5366.000000 18
  187.050000 1279.000000 4
  188.050000 3304.000000 11
  189.000000 1714.000000 6
  190.000000 1897.000000 6
  191.000000 7150.000000 24
  192.050000 1351.000000 5
  193.100000 620.000000 2
  194.100000 103.000000 1
  195.100000 124.000000 1
  196.100000 94.000000 1
  197.100000 73.000000 1
  198.100000 146.000000 1
  199.100000 70.000000 1
  200.100000 735.000000 2
  201.100000 599.000000 2
  202.100000 33476.000000 112
  203.050000 28362.000000 95
  204.050000 11457.000000 38
  205.050000 3960.000000 13
  206.000000 1380.000000 5
  207.000000 1068.000000 4
  208.000000 334.000000 1
  209.000000 236.000000 1
  210.000000 82.000000 1
  211.000000 100.000000 1
  212.000000 63.000000 1
  213.000000 65.000000 1
  214.000000 586.000000 2
  215.000000 295.000000 1
  216.100000 1966.000000 7
  217.150000 4855.000000 16
  218.100000 294994.000000 990
  219.050000 297646.000000 999
  220.050000 72183.000000 242
  221.050000 33748.000000 113
  222.050000 4866.000000 16
  223.100000 1641.000000 6
  224.100000 186.000000 1
  225.100000 116.000000 1
  226.100000 34.000000 1
  227.100000 55.000000 1
  228.100000 140.000000 1
  229.100000 182.000000 1
  230.050000 10229.000000 34
  231.050000 3769.000000 13
  232.050000 2037.000000 7
  233.000000 484.000000 2
  234.000000 148.000000 1
  235.000000 22.000000 1
  236.000000 63.000000 1
  237.000000 63.000000 1
  239.000000 65.000000 1
  241.000000 8.000000 1
  243.000000 11.000000 1
  244.000000 351.000000 1
  245.000000 190.000000 1
  246.000000 884.000000 3
  247.000000 188.000000 1
  248.100000 2658.000000 9
  249.100000 690.000000 2
  250.100000 430.000000 1
  251.100000 106.000000 1
  252.100000 73.000000 1
  252.950000 1148.000000 4
  253.900000 356.000000 1
  254.900000 202.000000 1
  256.900000 126.000000 1
  257.900000 22.000000 1
  258.900000 24.000000 1
  259.900000 55.000000 1
  260.900000 130.000000 1
  261.900000 142.000000 1
  262.900000 78.000000 1
  263.900000 230.000000 1
  264.900000 74.000000 1
  265.900000 95.000000 1
  266.900000 60.000000 1
  267.900000 76.000000 1
  268.900000 230.000000 1
  269.900000 110.000000 1
  270.900000 49.000000 1
  271.900000 130.000000 1
  272.900000 44.000000 1
  273.900000 159.000000 1
  274.900000 186.000000 1
  276.100000 2201.000000 7
  277.100000 871.000000 3
  278.100000 385.000000 1
  279.100000 137.000000 1
  280.100000 52.000000 1
  281.100000 111.000000 1
  284.100000 39.000000 1
  285.100000 58.000000 1
  288.100000 169.000000 1
  289.100000 121.000000 1
  290.150000 1108.000000 4
  291.100000 107010.000000 359
  292.150000 71745.000000 241
  293.100000 24911.000000 84
  294.100000 8465.000000 28
  295.150000 2047.000000 7
  296.200000 326.000000 1
  297.200000 46.000000 1
  298.200000 55.000000 1
  299.200000 5.000000 1
  300.200000 14.000000 1
  301.200000 21.000000 1
  302.200000 90.000000 1
  304.200000 322.000000 1
  305.200000 190.000000 1
  306.200000 294.000000 1
  307.200000 5.000000 1
  308.200000 19.000000 1
  309.200000 6.000000 1
  311.200000 81.000000 1
  313.200000 142.000000 1
  314.200000 73.000000 1
  315.200000 90.000000 1
  316.200000 71.000000 1
  317.200000 44.000000 1
  318.200000 148.000000 1
  319.100000 183.000000 1
  320.150000 18536.000000 62
  321.100000 4766.000000 16
  322.100000 2193.000000 7
  323.100000 489.000000 2
  324.100000 175.000000 1
  325.100000 39.000000 1
  326.100000 33.000000 1
  327.100000 337.000000 1
  328.100000 209.000000 1
  329.100000 137.000000 1
  330.100000 97.000000 1
  331.100000 318.000000 1
  332.100000 89.000000 1
  333.100000 76.000000 1
  334.100000 446.000000 1
  335.100000 471.000000 2
  336.100000 417.000000 1
  337.100000 186.000000 1
  338.100000 47.000000 1
  341.100000 55.000000 1
  342.100000 151.000000 1
  343.100000 30.000000 1
  345.100000 2.000000 1
  346.100000 106.000000 1
  347.100000 116.000000 1
  348.100000 86.000000 1
  349.100000 170.000000 1
  350.100000 47.000000 1
  352.100000 22.000000 1
  353.100000 79.000000 1
  354.100000 100.000000 1
  355.100000 86.000000 1
  356.100000 5.000000 1
  358.100000 10.000000 1
  359.100000 84.000000 1
  360.100000 27.000000 1
  361.100000 54.000000 1
  363.100000 105.000000 1
  364.100000 73.000000 1
  365.100000 30.000000 1
  367.100000 33.000000 1
  368.100000 16.000000 1
  370.100000 52.000000 1
  371.100000 60.000000 1
  372.100000 46.000000 1
  373.100000 118.000000 1
  374.100000 55.000000 1
  376.100000 49.000000 1
  377.100000 41.000000 1
  378.100000 114.000000 1
  379.100000 154.000000 1
  380.100000 119.000000 1
  381.100000 84.000000 1
  382.100000 42.000000 1
  383.100000 162.000000 1
  384.100000 84.000000 1
  385.100000 33.000000 1
  386.100000 110.000000 1
  387.100000 14.000000 1
  388.100000 90.000000 1
  389.100000 116.000000 1
  390.100000 16.000000 1
  391.100000 57.000000 1
  392.100000 79.000000 1
  393.100000 54.000000 1
  395.100000 11.000000 1
  397.100000 8.000000 1
  398.100000 31.000000 1
  399.100000 39.000000 1
  400.100000 46.000000 1
  401.100000 68.000000 1
  402.100000 110.000000 1
  403.100000 74.000000 1
  404.100000 49.000000 1
  405.100000 233.000000 1
  406.100000 108.000000 1
  407.100000 132.000000 1
  409.100000 36.000000 1
  411.100000 39.000000 1
  412.100000 66.000000 1
  413.100000 38.000000 1
  414.100000 137.000000 1
  415.100000 82.000000 1
  416.100000 46.000000 1
  417.100000 55.000000 1
  418.100000 97.000000 1
  419.100000 10.000000 1
  420.100000 21.000000 1
  421.100000 42.000000 1
  423.100000 34.000000 1
  424.100000 30.000000 1
  425.100000 81.000000 1
  427.100000 68.000000 1
  428.100000 97.000000 1
  430.100000 87.000000 1
  431.100000 52.000000 1
  432.100000 158.000000 1
  433.100000 19.000000 1
  434.100000 11.000000 1
  435.100000 68.000000 1
  437.100000 127.000000 1
  439.100000 8.000000 1
  440.100000 116.000000 1
  441.100000 65.000000 1
  442.100000 65.000000 1
  443.100000 62.000000 1
  444.100000 11.000000 1
  446.100000 33.000000 1
  447.100000 70.000000 1
  448.100000 41.000000 1
  449.100000 78.000000 1
  450.100000 50.000000 1
  451.100000 78.000000 1
  452.100000 39.000000 1
  454.100000 2.000000 1
  455.100000 60.000000 1
  458.100000 76.000000 1
  460.100000 38.000000 1
  461.100000 63.000000 1
  462.100000 14.000000 1
  463.100000 95.000000 1
  464.100000 119.000000 1
  465.100000 50.000000 1
  466.100000 94.000000 1
  467.100000 26.000000 1
  469.100000 52.000000 1
  470.100000 31.000000 1
  471.100000 31.000000 1
  472.100000 63.000000 1
  474.100000 22.000000 1
  475.100000 58.000000 1
  476.100000 66.000000 1
  477.100000 57.000000 1
  480.100000 106.000000 1
  481.100000 121.000000 1
  482.100000 63.000000 1
  483.100000 55.000000 1
  484.100000 66.000000 1
  485.100000 38.000000 1
  486.100000 22.000000 1
  487.100000 106.000000 1
  488.100000 26.000000 1
  489.100000 137.000000 1
  490.100000 60.000000 1
  491.100000 73.000000 1
  492.100000 121.000000 1
  495.100000 14.000000 1
  496.100000 50.000000 1
  497.100000 79.000000 1
  498.100000 90.000000 1