ACCESSION: MSBNK-GL_Sciences_Inc-GLS00043
RECORD_TITLE: L-Serine; EI-B; MS; 2 TMS; RT: 440.66 s
DATE: 2016.01.19 (Created 2012.08.03, modified 2013.07.31)
AUTHORS: Miyagawa H, Akimoto S, Yamasaki K, GL Sciences Inc.
LICENSE: CC BY-SA
COPYRIGHT: GL Sciences Inc.
COMMENT: The chemical compound was chemically modified with N-methyl-N-trimethylsilyl-trifluoroacetamide(MSTFA) before GC-MS analysis. When it has two or more functional groups, this modification gave a mixture of the TMS derivatives having different number of TMS groups at different functional groups.

CH$NAME: L-Serine
CH$COMPOUND_CLASS: Natural Product
CH$FORMULA: C3H7NO3
CH$EXACT_MASS: 105.04259
CH$SMILES: OC[C@H](N)C(O)=O
CH$IUPAC: InChI=1S/C3H7NO3/c4-2(1-5)3(6)7/h2,5H,1,4H2,(H,6,7)/t2-/m0/s1
CH$LINK: CAS 56-45-1
CH$LINK: CHEBI 17115
CH$LINK: KEGG C00065
CH$LINK: PUBCHEM 3365
CH$LINK: INCHIKEY MTCFGRXMJLQNBG-REOHCLBHSA-N
CH$LINK: COMPTOX DTXSID60883230

AC$INSTRUMENT: GCMS-2010 Plus, Shimadzu
AC$INSTRUMENT_TYPE: EI-B
AC$MASS_SPECTROMETRY: MS_TYPE MS
AC$MASS_SPECTROMETRY: ION_MODE POSITIVE
AC$MASS_SPECTROMETRY: GAS_PRESSURE 75 kPa
AC$MASS_SPECTROMETRY: ION_SOURCE_TEMPERATURE 200 C
AC$MASS_SPECTROMETRY: SCAN_RANGE_M/Z 85-500
AC$CHROMATOGRAPHY: COLUMN_NAME InertCap 5MS/NP 0.25 mmI.D. x 30 m, df=0.25 um
AC$CHROMATOGRAPHY: INJECTION_TEMPERATURE 230 C
AC$CHROMATOGRAPHY: OVEN_TEMPERATURE 80 C(2 min)-15 C/min - 330C
AC$CHROMATOGRAPHY: RETENTION_INDEX 1264
AC$CHROMATOGRAPHY: RETENTION_TIME 440.66
AC$CHROMATOGRAPHY: TRANSFARLINE_TEMPERATURE 250 C

MS$FOCUSED_ION: DERIVATIVE_TYPE 2 TMS
MS$DATA_PROCESSING: WHOLE GCMSsolution

PK$SPLASH: splash10-0159-0900000000-ae4f860052c41e9ba734
PK$NUM_PEAK: 363
PK$PEAK: m/z int. rel.int.
  86.050000 16562.000000 17
  87.050000 16337.000000 17
  88.050000 33671.000000 35
  89.050000 16770.000000 18
  90.050000 5565.000000 6
  91.050000 12423.000000 13
  92.100000 1316.000000 1
  93.100000 762.000000 1
  94.100000 279.000000 1
  95.600000 9574.000000 10
  96.550000 1060.000000 1
  98.050000 2674.000000 3
  99.100000 3518.000000 4
  100.050000 56277.000000 59
  101.050000 21367.000000 22
  102.050000 20649.000000 22
  103.050000 165368.000000 173
  104.100000 15567.000000 16
  105.100000 8378.000000 9
  106.100000 625.000000 1
  107.100000 273.000000 1
  108.100000 18.000000 1
  109.550000 2372.000000 2
  110.500000 330.000000 1
  111.500000 156.000000 1
  112.100000 489.000000 1
  113.050000 1293.000000 1
  114.100000 3316.000000 3
  115.150000 12730.000000 13
  116.100000 954057.000000 999
  117.100000 115690.000000 121
  118.100000 43436.000000 45
  119.050000 6250.000000 7
  120.050000 1037.000000 1
  121.000000 345.000000 1
  123.000000 50.000000 1
  124.000000 65.000000 1
  125.000000 137.000000 1
  126.000000 193.000000 1
  127.000000 359.000000 1
  128.050000 2642.000000 3
  129.150000 4413.000000 5
  130.050000 68516.000000 72
  131.100000 35012.000000 37
  132.100000 872562.000000 914
  133.100000 119156.000000 125
  134.100000 38655.000000 40
  135.100000 5194.000000 5
  136.100000 434.000000 1
  137.100000 94.000000 1
  138.100000 60.000000 1
  139.100000 68.000000 1
  140.100000 18.000000 1
  141.100000 100.000000 1
  142.050000 3067.000000 3
  143.150000 3989.000000 4
  144.050000 139727.000000 146
  145.100000 14926.000000 16
  146.100000 84425.000000 88
  147.100000 135647.000000 142
  148.100000 24482.000000 26
  149.100000 19206.000000 20
  150.100000 2500.000000 3
  151.100000 983.000000 1
  152.100000 106.000000 1
  153.100000 140.000000 1
  154.100000 94.000000 1
  155.100000 73.000000 1
  156.100000 124.000000 1
  157.100000 247.000000 1
  158.150000 1447.000000 2
  159.100000 61524.000000 64
  160.100000 8671.000000 9
  161.100000 3354.000000 4
  162.100000 575.000000 1
  163.150000 1246.000000 1
  164.100000 260.000000 1
  165.100000 154.000000 1
  166.100000 135.000000 1
  167.100000 21.000000 1
  168.100000 126.000000 1
  169.100000 119.000000 1
  170.100000 94.000000 1
  171.100000 100.000000 1
  172.100000 1263.000000 1
  173.000000 564.000000 1
  174.050000 4056.000000 4
  175.050000 1519.000000 2
  176.000000 812.000000 1
  177.050000 1360.000000 1
  178.100000 383.000000 1
  179.100000 297.000000 1
  180.100000 129.000000 1
  181.100000 30.000000 1
  183.100000 81.000000 1
  184.100000 52.000000 1
  185.100000 42.000000 1
  186.100000 121.000000 1
  187.100000 210.000000 1
  188.050000 24818.000000 26
  189.050000 9364.000000 10
  190.050000 5254.000000 6
  191.050000 1444.000000 2
  192.000000 447.000000 1
  193.000000 231.000000 1
  194.000000 98.000000 1
  195.000000 54.000000 1
  197.000000 58.000000 1
  198.000000 90.000000 1
  199.000000 78.000000 1
  200.000000 367.000000 1
  201.000000 31.000000 1
  202.000000 148.000000 1
  203.050000 1549.000000 2
  204.050000 4783.000000 5
  205.100000 1418.000000 1
  206.100000 11708.000000 12
  207.050000 2763.000000 3
  208.100000 1282.000000 1
  209.100000 206.000000 1
  210.100000 146.000000 1
  211.100000 52.000000 1
  212.100000 3.000000 1
  213.100000 44.000000 1
  214.100000 33.000000 1
  215.100000 74.000000 1
  216.050000 9804.000000 10
  217.050000 6209.000000 7
  218.150000 5167.000000 5
  219.050000 64629.000000 68
  220.100000 12975.000000 14
  221.100000 5287.000000 6
  222.050000 916.000000 1
  223.100000 271.000000 1
  224.100000 134.000000 1
  225.100000 79.000000 1
  226.100000 119.000000 1
  228.100000 29.000000 1
  229.100000 34.000000 1
  230.100000 52.000000 1
  231.100000 166.000000 1
  232.100000 1265.000000 1
  233.100000 687.000000 1
  234.100000 48879.000000 51
  235.050000 9017.000000 9
  236.100000 4223.000000 4
  237.100000 554.000000 1
  238.100000 169.000000 1
  239.100000 39.000000 1
  240.100000 52.000000 1
  241.100000 27.000000 1
  242.100000 30.000000 1
  243.100000 103.000000 1
  244.100000 36.000000 1
  245.100000 65.000000 1
  246.100000 68.000000 1
  247.100000 447.000000 1
  248.100000 236.000000 1
  249.100000 1057.000000 1
  250.150000 3000.000000 3
  251.100000 514.000000 1
  252.100000 129.000000 1
  253.100000 559.000000 1
  254.100000 121.000000 1
  255.100000 114.000000 1
  258.100000 27.000000 1
  259.100000 42.000000 1
  260.100000 110.000000 1
  261.100000 135.000000 1
  262.100000 119.000000 1
  263.100000 199.000000 1
  264.100000 162.000000 1
  265.100000 54.000000 1
  266.100000 70.000000 1
  267.100000 30.000000 1
  268.100000 108.000000 1
  269.100000 38.000000 1
  272.100000 54.000000 1
  273.100000 65.000000 1
  274.100000 145.000000 1
  275.100000 30.000000 1
  276.100000 156.000000 1
  277.100000 108.000000 1
  278.100000 462.000000 1
  279.100000 310.000000 1
  280.100000 145.000000 1
  281.100000 55.000000 1
  282.100000 86.000000 1
  283.100000 49.000000 1
  284.100000 38.000000 1
  285.100000 18.000000 1
  286.100000 49.000000 1
  287.100000 97.000000 1
  288.100000 57.000000 1
  289.100000 33.000000 1
  290.100000 29.000000 1
  291.100000 121.000000 1
  292.100000 167.000000 1
  293.100000 57.000000 1
  294.100000 252.000000 1
  295.100000 162.000000 1
  297.100000 26.000000 1
  298.100000 29.000000 1
  299.100000 82.000000 1
  300.100000 10.000000 1
  301.100000 22.000000 1
  302.100000 38.000000 1
  303.100000 18.000000 1
  304.100000 100.000000 1
  305.100000 55.000000 1
  306.100000 196.000000 1
  307.100000 612.000000 1
  308.100000 74.000000 1
  309.100000 630.000000 1
  310.100000 114.000000 1
  311.100000 19.000000 1
  312.100000 102.000000 1
  313.100000 94.000000 1
  314.100000 18.000000 1
  315.100000 73.000000 1
  316.100000 46.000000 1
  317.100000 55.000000 1
  318.100000 111.000000 1
  319.100000 55.000000 1
  320.100000 31.000000 1
  321.100000 42.000000 1
  322.100000 270.000000 1
  323.100000 97.000000 1
  324.100000 47.000000 1
  325.100000 22.000000 1
  327.100000 108.000000 1
  328.100000 191.000000 1
  329.100000 94.000000 1
  330.100000 22.000000 1
  331.100000 145.000000 1
  332.100000 54.000000 1
  333.100000 31.000000 1
  335.100000 24.000000 1
  338.100000 71.000000 1
  339.100000 10.000000 1
  340.100000 60.000000 1
  341.100000 132.000000 1
  342.100000 30.000000 1
  343.100000 122.000000 1
  344.100000 38.000000 1
  345.100000 73.000000 1
  346.100000 137.000000 1
  347.100000 54.000000 1
  348.100000 26.000000 1
  349.100000 24.000000 1
  350.100000 76.000000 1
  351.100000 50.000000 1
  352.100000 58.000000 1
  353.100000 31.000000 1
  354.100000 68.000000 1
  355.100000 111.000000 1
  356.100000 68.000000 1
  357.100000 46.000000 1
  358.100000 26.000000 1
  359.100000 27.000000 1
  360.100000 47.000000 1
  361.100000 39.000000 1
  362.100000 16.000000 1
  364.100000 29.000000 1
  366.100000 76.000000 1
  367.100000 134.000000 1
  369.100000 54.000000 1
  371.100000 29.000000 1
  372.100000 62.000000 1
  374.100000 52.000000 1
  375.100000 11.000000 1
  377.100000 29.000000 1
  378.100000 66.000000 1
  379.100000 92.000000 1
  380.100000 50.000000 1
  382.100000 24.000000 1
  383.100000 16.000000 1
  385.100000 84.000000 1
  386.100000 26.000000 1
  387.100000 94.000000 1
  388.100000 86.000000 1
  389.100000 65.000000 1
  390.100000 82.000000 1
  391.100000 66.000000 1
  392.100000 65.000000 1
  393.100000 68.000000 1
  394.100000 13.000000 1
  396.100000 122.000000 1
  397.100000 97.000000 1
  398.100000 33.000000 1
  399.100000 78.000000 1
  401.100000 111.000000 1
  402.100000 119.000000 1
  403.100000 58.000000 1
  404.100000 57.000000 1
  405.100000 118.000000 1
  406.100000 62.000000 1
  407.100000 174.000000 1
  408.100000 105.000000 1
  409.100000 8.000000 1
  411.100000 63.000000 1
  412.100000 39.000000 1
  413.100000 100.000000 1
  414.100000 106.000000 1
  416.100000 108.000000 1
  418.100000 81.000000 1
  420.100000 14.000000 1
  421.100000 60.000000 1
  422.100000 97.000000 1
  424.100000 3.000000 1
  425.100000 50.000000 1
  426.100000 52.000000 1
  427.100000 36.000000 1
  428.100000 97.000000 1
  429.100000 22.000000 1
  430.100000 29.000000 1
  431.100000 42.000000 1
  433.100000 16.000000 1
  434.100000 21.000000 1
  437.100000 10.000000 1
  438.100000 38.000000 1
  440.100000 29.000000 1
  441.100000 76.000000 1
  442.100000 71.000000 1
  443.100000 65.000000 1
  444.100000 6.000000 1
  445.100000 16.000000 1
  446.100000 89.000000 1
  447.100000 6.000000 1
  448.100000 8.000000 1
  449.100000 89.000000 1
  451.100000 98.000000 1
  452.100000 5.000000 1
  453.100000 84.000000 1
  455.100000 5.000000 1
  456.100000 41.000000 1
  461.100000 2.000000 1
  462.100000 24.000000 1
  465.100000 58.000000 1
  466.100000 22.000000 1
  470.100000 3.000000 1
  471.100000 27.000000 1
  472.100000 65.000000 1
  474.100000 6.000000 1
  475.100000 24.000000 1
  476.100000 94.000000 1
  477.100000 89.000000 1
  478.100000 81.000000 1
  479.100000 122.000000 1
  481.100000 74.000000 1
  482.100000 16.000000 1
  483.100000 60.000000 1
  485.100000 11.000000 1
  486.100000 63.000000 1
  487.100000 62.000000 1
  488.100000 66.000000 1
  491.100000 129.000000 1
  493.100000 16.000000 1
  495.100000 62.000000 1
  496.100000 42.000000 1
  497.100000 50.000000 1
  498.100000 27.000000 1
  499.100000 50.000000 1