ACCESSION: MSBNK-GL_Sciences_Inc-GLS00046
RECORD_TITLE: D-homoserine; EI-B; MS; 3 TMS; RT: 558.55 s
DATE: 2016.01.19 (Created 2012.08.03, modified 2013.07.31)
AUTHORS: Miyagawa H, Akimoto S, Yamasaki K, GL Sciences Inc.
LICENSE: CC BY-SA
COPYRIGHT: GL Sciences Inc.
COMMENT: The chemical compound was chemically modified with N-methyl-N-trimethylsilyl-trifluoroacetamide(MSTFA) before GC-MS analysis. When it has two or more functional groups, this modification gave a mixture of the TMS derivatives having different number of TMS groups at different functional groups.

CH$NAME: D-homoserine
CH$COMPOUND_CLASS: Natural Product
CH$FORMULA: C4H9NO3
CH$EXACT_MASS: 119.05824
CH$SMILES: OCCC(N)C(O)=O
CH$IUPAC: InChI=1S/C4H9NO3/c5-3(1-2-6)4(7)8/h3,6H,1-2,5H2,(H,7,8)/t3-/m1/s1
CH$LINK: CAS 6027-21-0
CH$LINK: CHEBI 30654
CH$LINK: INCHIKEY UKAUYVFTDYCKQA-GSVOUGTGSA-N
CH$LINK: COMPTOX DTXSID10209022

AC$INSTRUMENT: GCMS-2010 Plus, Shimadzu
AC$INSTRUMENT_TYPE: EI-B
AC$MASS_SPECTROMETRY: MS_TYPE MS
AC$MASS_SPECTROMETRY: ION_MODE POSITIVE
AC$MASS_SPECTROMETRY: GAS_PRESSURE 75 kPa
AC$MASS_SPECTROMETRY: ION_SOURCE_TEMPERATURE 200 C
AC$MASS_SPECTROMETRY: SCAN_RANGE_M/Z 85-500
AC$CHROMATOGRAPHY: COLUMN_NAME InertCap 5MS/NP 0.25 mmI.D. x 30 m, df=0.25 um
AC$CHROMATOGRAPHY: INJECTION_TEMPERATURE 230 C
AC$CHROMATOGRAPHY: OVEN_TEMPERATURE 80 C(2 min)-15 C/min - 330C
AC$CHROMATOGRAPHY: RETENTION_INDEX 1461
AC$CHROMATOGRAPHY: RETENTION_TIME 558.55
AC$CHROMATOGRAPHY: TRANSFARLINE_TEMPERATURE 250 C

MS$FOCUSED_ION: DERIVATIVE_TYPE 3 TMS
MS$DATA_PROCESSING: WHOLE GCMSsolution

PK$SPLASH: splash10-014i-0790000000-fb03bb9e58de0f66de6c
PK$NUM_PEAK: 373
PK$PEAK: m/z int. rel.int.
  86.050000 7001.000000 8
  87.000000 4983.000000 5
  88.050000 1854.000000 2
  89.050000 2836.000000 3
  90.100000 580.000000 1
  91.100000 527.000000 1
  92.100000 134.000000 1
  93.100000 308.000000 1
  94.100000 290.000000 1
  95.100000 206.000000 1
  96.100000 404.000000 1
  97.100000 673.000000 1
  98.050000 5136.000000 6
  99.150000 2168.000000 2
  100.100000 54564.000000 59
  101.100000 14002.000000 15
  102.100000 43396.000000 47
  103.100000 250521.000000 270
  104.100000 25222.000000 27
  105.050000 12063.000000 13
  106.100000 558.000000 1
  107.100000 151.000000 1
  108.100000 138.000000 1
  109.100000 122.000000 1
  110.100000 854.000000 1
  111.100000 345.000000 1
  112.100000 5182.000000 6
  113.100000 1948.000000 2
  114.100000 11942.000000 13
  115.050000 6622.000000 7
  116.050000 4335.000000 5
  117.050000 10977.000000 12
  118.050000 2852.000000 3
  119.000000 4297.000000 5
  120.000000 606.000000 1
  121.000000 465.000000 1
  122.000000 82.000000 1
  123.000000 14.000000 1
  124.000000 118.000000 1
  125.000000 119.000000 1
  126.050000 2071.000000 2
  127.150000 2066.000000 2
  128.100000 388961.000000 419
  129.100000 51215.000000 55
  130.100000 40465.000000 44
  131.100000 40577.000000 44
  132.100000 16254.000000 18
  133.100000 32460.000000 35
  134.100000 6322.000000 7
  135.050000 3328.000000 4
  136.000000 300.000000 1
  137.000000 159.000000 1
  138.000000 116.000000 1
  139.000000 70.000000 1
  140.100000 1734.000000 2
  141.100000 463.000000 1
  142.100000 3409.000000 4
  143.100000 1060.000000 1
  144.100000 4222.000000 5
  145.150000 1139.000000 1
  146.150000 16943.000000 18
  147.100000 105943.000000 114
  148.100000 18319.000000 20
  149.100000 14332.000000 15
  150.050000 2339.000000 3
  151.100000 631.000000 1
  152.100000 97.000000 1
  153.100000 180.000000 1
  154.100000 276.000000 1
  155.100000 127.000000 1
  156.100000 5210.000000 6
  157.100000 1410.000000 2
  158.100000 6991.000000 8
  159.050000 2652.000000 3
  160.100000 1346.000000 1
  161.100000 1060.000000 1
  162.100000 316.000000 1
  163.100000 1991.000000 2
  164.100000 343.000000 1
  165.100000 206.000000 1
  166.100000 29.000000 1
  168.100000 130.000000 1
  169.100000 119.000000 1
  170.100000 310.000000 1
  171.100000 282.000000 1
  172.100000 6007.000000 6
  173.100000 2695.000000 3
  174.100000 9746.000000 11
  175.050000 2804.000000 3
  176.100000 3700.000000 4
  177.050000 3864.000000 4
  178.000000 833.000000 1
  179.000000 377.000000 1
  180.000000 84.000000 1
  181.000000 146.000000 1
  182.000000 116.000000 1
  183.000000 98.000000 1
  184.000000 244.000000 1
  185.000000 127.000000 1
  186.000000 1553.000000 2
  187.100000 479.000000 1
  188.100000 7305.000000 8
  189.050000 2225.000000 2
  190.050000 2093.000000 2
  191.050000 4708.000000 5
  192.050000 1135.000000 1
  193.050000 1298.000000 1
  194.100000 225.000000 1
  195.100000 82.000000 1
  196.100000 57.000000 1
  198.100000 194.000000 1
  199.100000 42.000000 1
  200.100000 2399.000000 3
  201.150000 1118.000000 1
  202.100000 39383.000000 42
  203.100000 8569.000000 9
  204.100000 5839.000000 6
  205.050000 1167.000000 1
  206.000000 644.000000 1
  207.000000 823.000000 1
  208.000000 194.000000 1
  209.000000 142.000000 1
  210.000000 3.000000 1
  212.000000 110.000000 1
  213.000000 132.000000 1
  214.100000 1055.000000 1
  215.100000 604.000000 1
  216.100000 14252.000000 15
  217.150000 14149.000000 15
  218.100000 926806.000000 999
  219.100000 200394.000000 216
  220.100000 84129.000000 91
  221.100000 14162.000000 15
  222.100000 2950.000000 3
  223.100000 473.000000 1
  224.100000 175.000000 1
  225.100000 94.000000 1
  226.100000 50.000000 1
  227.100000 154.000000 1
  228.100000 233.000000 1
  229.100000 377.000000 1
  230.100000 43388.000000 47
  231.100000 8937.000000 10
  232.100000 8286.000000 9
  233.050000 1606.000000 2
  234.100000 530.000000 1
  235.100000 105.000000 1
  236.100000 16.000000 1
  237.100000 164.000000 1
  238.100000 142.000000 1
  239.100000 33.000000 1
  240.100000 161.000000 1
  241.100000 156.000000 1
  242.100000 18.000000 1
  243.100000 50.000000 1
  244.100000 329.000000 1
  245.100000 4002.000000 4
  246.100000 2246.000000 2
  247.100000 846.000000 1
  248.100000 756.000000 1
  249.100000 153.000000 1
  250.100000 119.000000 1
  251.100000 100.000000 1
  252.100000 105.000000 1
  253.100000 812.000000 1
  254.100000 185.000000 1
  255.100000 34.000000 1
  256.100000 118.000000 1
  257.100000 82.000000 1
  258.100000 98.000000 1
  260.100000 127.000000 1
  261.100000 79.000000 1
  262.100000 186.000000 1
  263.100000 161.000000 1
  264.100000 223.000000 1
  265.100000 457.000000 1
  266.100000 183.000000 1
  267.100000 100.000000 1
  268.100000 159.000000 1
  269.100000 100.000000 1
  270.100000 63.000000 1
  271.100000 11.000000 1
  272.100000 94.000000 1
  275.100000 21.000000 1
  276.100000 366.000000 1
  277.100000 188.000000 1
  278.100000 156.000000 1
  279.100000 33.000000 1
  280.100000 63.000000 1
  281.100000 54.000000 1
  282.100000 162.000000 1
  283.100000 126.000000 1
  284.100000 6.000000 1
  285.100000 76.000000 1
  286.100000 58.000000 1
  287.100000 31.000000 1
  288.100000 39.000000 1
  289.100000 68.000000 1
  290.150000 2464.000000 3
  291.250000 1139.000000 1
  292.150000 35339.000000 38
  293.100000 9298.000000 10
  294.150000 5271.000000 6
  295.100000 921.000000 1
  296.100000 252.000000 1
  297.100000 97.000000 1
  298.100000 38.000000 1
  299.100000 19.000000 1
  301.100000 105.000000 1
  302.100000 16.000000 1
  303.100000 38.000000 1
  304.100000 145.000000 1
  305.100000 156.000000 1
  306.100000 145.000000 1
  309.100000 22.000000 1
  310.100000 54.000000 1
  311.100000 58.000000 1
  312.100000 78.000000 1
  313.100000 29.000000 1
  314.100000 6.000000 1
  315.100000 27.000000 1
  316.100000 39.000000 1
  317.100000 95.000000 1
  318.100000 60.000000 1
  319.200000 258.000000 1
  320.150000 13983.000000 15
  321.150000 4305.000000 5
  322.150000 2401.000000 3
  323.200000 399.000000 1
  324.200000 79.000000 1
  325.200000 68.000000 1
  326.200000 97.000000 1
  327.200000 87.000000 1
  328.200000 66.000000 1
  329.200000 87.000000 1
  330.200000 137.000000 1
  331.200000 124.000000 1
  332.200000 214.000000 1
  334.200000 60.000000 1
  335.150000 7557.000000 8
  336.150000 2642.000000 3
  337.200000 1111.000000 1
  338.200000 407.000000 1
  339.200000 135.000000 1
  340.200000 74.000000 1
  341.200000 60.000000 1
  342.200000 108.000000 1
  343.200000 78.000000 1
  344.200000 116.000000 1
  345.200000 119.000000 1
  346.200000 108.000000 1
  347.200000 102.000000 1
  348.200000 94.000000 1
  349.200000 46.000000 1
  350.200000 60.000000 1
  351.200000 82.000000 1
  352.200000 65.000000 1
  353.200000 150.000000 1
  355.200000 38.000000 1
  358.200000 76.000000 1
  359.200000 138.000000 1
  360.200000 100.000000 1
  361.200000 121.000000 1
  362.200000 102.000000 1
  363.200000 103.000000 1
  365.200000 95.000000 1
  366.200000 73.000000 1
  367.200000 102.000000 1
  370.200000 50.000000 1
  371.200000 110.000000 1
  374.200000 76.000000 1
  375.200000 71.000000 1
  376.200000 44.000000 1
  377.200000 71.000000 1
  378.200000 14.000000 1
  379.200000 70.000000 1
  381.200000 41.000000 1
  382.200000 105.000000 1
  383.200000 74.000000 1
  384.200000 74.000000 1
  385.200000 71.000000 1
  386.200000 105.000000 1
  387.200000 54.000000 1
  388.200000 54.000000 1
  389.200000 92.000000 1
  390.200000 39.000000 1
  391.200000 97.000000 1
  392.200000 2.000000 1
  393.200000 42.000000 1
  395.200000 6.000000 1
  396.200000 14.000000 1
  397.200000 89.000000 1
  400.200000 46.000000 1
  401.200000 63.000000 1
  402.200000 2.000000 1
  403.200000 6.000000 1
  405.200000 111.000000 1
  406.200000 71.000000 1
  407.200000 68.000000 1
  408.200000 73.000000 1
  409.200000 11.000000 1
  410.200000 13.000000 1
  411.200000 14.000000 1
  413.200000 41.000000 1
  414.200000 111.000000 1
  415.200000 68.000000 1
  416.200000 113.000000 1
  417.200000 102.000000 1
  420.200000 47.000000 1
  421.200000 36.000000 1
  424.200000 46.000000 1
  425.200000 31.000000 1
  426.200000 122.000000 1
  427.200000 52.000000 1
  429.200000 5.000000 1
  430.200000 55.000000 1
  431.200000 50.000000 1
  432.200000 108.000000 1
  433.200000 103.000000 1
  434.200000 27.000000 1
  435.200000 33.000000 1
  436.200000 65.000000 1
  439.200000 50.000000 1
  440.200000 36.000000 1
  442.200000 16.000000 1
  444.200000 8.000000 1
  446.200000 98.000000 1
  447.200000 5.000000 1
  448.200000 46.000000 1
  450.200000 82.000000 1
  452.200000 84.000000 1
  453.200000 24.000000 1
  454.200000 110.000000 1
  456.200000 73.000000 1
  457.200000 41.000000 1
  458.200000 79.000000 1
  459.200000 122.000000 1
  460.200000 134.000000 1
  461.200000 31.000000 1
  462.200000 86.000000 1
  463.200000 44.000000 1
  464.200000 41.000000 1
  465.200000 108.000000 1
  466.200000 70.000000 1
  467.200000 58.000000 1
  468.200000 111.000000 1
  469.200000 22.000000 1
  470.200000 52.000000 1
  471.200000 44.000000 1
  472.200000 38.000000 1
  473.200000 68.000000 1
  474.200000 62.000000 1
  475.200000 118.000000 1
  476.200000 49.000000 1
  477.200000 164.000000 1
  478.200000 63.000000 1
  479.200000 102.000000 1
  480.200000 94.000000 1
  481.200000 145.000000 1
  482.200000 50.000000 1
  483.200000 18.000000 1
  485.200000 68.000000 1
  486.200000 21.000000 1
  489.200000 90.000000 1
  490.200000 134.000000 1
  491.200000 60.000000 1
  492.200000 126.000000 1
  494.200000 68.000000 1
  495.200000 47.000000 1
  496.200000 36.000000 1
  497.200000 103.000000 1
  498.200000 39.000000 1
  499.200000 84.000000 1