ACCESSION: MSBNK-GL_Sciences_Inc-GLS00057
RECORD_TITLE: L-(-)-Phenylalanine; EI-B; MS; 2 TMS; RT: 654.48 s
DATE: 2016.01.19 (Created 2012.08.03, modified 2013.07.31)
AUTHORS: Miyagawa H, Akimoto S, Yamasaki K, GL Sciences Inc.
LICENSE: CC BY-SA
COPYRIGHT: GL Sciences Inc.
COMMENT: The chemical compound was chemically modified with N-methyl-N-trimethylsilyl-trifluoroacetamide(MSTFA) before GC-MS analysis. When it has two or more functional groups, this modification gave a mixture of the TMS derivatives having different number of TMS groups at different functional groups.

CH$NAME: L-(-)-Phenylalanine
CH$COMPOUND_CLASS: Natural Product
CH$FORMULA: C9H11NO2
CH$EXACT_MASS: 165.07898
CH$SMILES: C1=CC=C(C=C1)C[C@@H](C(=O)O)N
CH$IUPAC: InChI=1S/C9H11NO2/c10-8(9(11)12)6-7-4-2-1-3-5-7/h1-5,8H,6,10H2,(H,11,12)/t8-/m0/s1
CH$LINK: CAS 63-91-2
CH$LINK: CHEBI 17295
CH$LINK: KEGG C00079
CH$LINK: PUBCHEM CID:6140
CH$LINK: INCHIKEY COLNVLDHVKWLRT-QMMMGPOBSA-N
CH$LINK: COMPTOX DTXSID4040763

AC$INSTRUMENT: GCMS-2010 Plus, Shimadzu
AC$INSTRUMENT_TYPE: EI-B
AC$MASS_SPECTROMETRY: MS_TYPE MS
AC$MASS_SPECTROMETRY: ION_MODE POSITIVE
AC$MASS_SPECTROMETRY: GAS_PRESSURE 75 kPa
AC$MASS_SPECTROMETRY: ION_SOURCE_TEMPERATURE 200 C
AC$MASS_SPECTROMETRY: SCAN_RANGE_M/Z 85-500
AC$CHROMATOGRAPHY: COLUMN_NAME InertCap 5MS/NP 0.25 mmI.D. x 30 m, df=0.25 um
AC$CHROMATOGRAPHY: INJECTION_TEMPERATURE 230 C
AC$CHROMATOGRAPHY: OVEN_TEMPERATURE 80 C(2 min)-15 C/min - 330C
AC$CHROMATOGRAPHY: RETENTION_INDEX 1643
AC$CHROMATOGRAPHY: RETENTION_TIME 654.48
AC$CHROMATOGRAPHY: TRANSFARLINE_TEMPERATURE 250 C

MS$FOCUSED_ION: DERIVATIVE_TYPE 2 TMS
MS$DATA_PROCESSING: WHOLE GCMSsolution

PK$SPLASH: splash10-014l-0970000000-792b341dd28b9e30bac2
PK$NUM_PEAK: 376
PK$PEAK: m/z int. rel.int.
  86.100000 7186.000000 13
  87.000000 2079.000000 4
  88.100000 922.000000 2
  89.050000 2411.000000 4
  90.100000 1487.000000 3
  91.100000 27748.000000 51
  92.100000 4318.000000 8
  93.050000 1496.000000 3
  94.100000 281.000000 1
  95.100000 324.000000 1
  96.100000 369.000000 1
  97.100000 257.000000 1
  98.100000 738.000000 1
  99.150000 1133.000000 2
  100.100000 155852.000000 285
  101.100000 18921.000000 35
  102.100000 8058.000000 15
  103.050000 12966.000000 24
  104.050000 2872.000000 5
  105.100000 2998.000000 5
  106.100000 558.000000 1
  107.100000 1106.000000 2
  108.100000 100.000000 1
  109.100000 175.000000 1
  110.100000 263.000000 1
  111.100000 84.000000 1
  112.100000 356.000000 1
  113.100000 644.000000 1
  114.100000 444.000000 1
  115.100000 4372.000000 8
  116.100000 1745.000000 3
  117.100000 7079.000000 13
  118.100000 3329.000000 6
  119.100000 3748.000000 7
  120.100000 9812.000000 18
  121.100000 5092.000000 9
  122.100000 609.000000 1
  123.100000 316.000000 1
  124.100000 137.000000 1
  125.100000 47.000000 1
  126.100000 430.000000 1
  127.100000 84.000000 1
  128.100000 1244.000000 2
  129.150000 1269.000000 2
  130.100000 17948.000000 33
  131.100000 12426.000000 23
  132.100000 11753.000000 21
  133.100000 15486.000000 28
  134.100000 3273.000000 6
  135.100000 4156.000000 8
  136.100000 585.000000 1
  137.100000 260.000000 1
  138.100000 81.000000 1
  140.100000 172.000000 1
  141.100000 263.000000 1
  142.100000 201.000000 1
  143.100000 241.000000 1
  144.150000 1386.000000 3
  145.100000 1964.000000 4
  146.150000 7523.000000 14
  147.150000 102517.000000 187
  148.150000 18261.000000 33
  149.150000 9229.000000 17
  150.100000 1153.000000 2
  151.100000 385.000000 1
  152.100000 126.000000 1
  153.100000 38.000000 1
  154.100000 121.000000 1
  155.100000 66.000000 1
  156.100000 190.000000 1
  157.100000 194.000000 1
  158.100000 1121.000000 2
  159.100000 2014.000000 4
  160.150000 7937.000000 14
  161.100000 2404.000000 4
  162.100000 3188.000000 6
  163.150000 9145.000000 17
  164.200000 1663.000000 3
  165.200000 679.000000 1
  166.200000 148.000000 1
  167.200000 42.000000 1
  169.200000 132.000000 1
  170.200000 66.000000 1
  171.200000 47.000000 1
  172.200000 690.000000 1
  173.100000 521.000000 1
  174.100000 3682.000000 7
  175.150000 1089.000000 2
  176.100000 7708.000000 14
  177.100000 11018.000000 20
  178.100000 2047.000000 4
  179.100000 854.000000 2
  180.100000 92.000000 1
  181.100000 2.000000 1
  182.100000 90.000000 1
  183.100000 27.000000 1
  184.100000 132.000000 1
  185.100000 49.000000 1
  186.100000 154.000000 1
  187.100000 114.000000 1
  188.100000 970.000000 2
  189.100000 162.000000 1
  190.100000 3465.000000 6
  191.150000 7274.000000 13
  192.100000 343425.000000 627
  193.100000 62791.000000 115
  194.100000 17161.000000 31
  195.050000 2068.000000 4
  196.100000 319.000000 1
  197.100000 27.000000 1
  198.100000 47.000000 1
  199.100000 124.000000 1
  200.100000 257.000000 1
  201.100000 66.000000 1
  202.100000 1268.000000 2
  203.100000 4290.000000 8
  204.100000 12350.000000 23
  205.100000 3228.000000 6
  206.100000 908.000000 2
  207.100000 570.000000 1
  208.100000 113.000000 1
  209.100000 233.000000 1
  210.100000 34.000000 1
  211.100000 19.000000 1
  212.100000 29.000000 1
  213.100000 30.000000 1
  214.100000 182.000000 1
  215.100000 46.000000 1
  216.100000 585.000000 1
  217.150000 2924.000000 5
  218.100000 547121.000000 999
  219.100000 107132.000000 196
  220.100000 47468.000000 87
  221.100000 6228.000000 11
  222.100000 1266.000000 2
  223.100000 247.000000 1
  224.100000 97.000000 1
  225.100000 21.000000 1
  226.100000 34.000000 1
  227.100000 114.000000 1
  228.100000 46.000000 1
  229.100000 13.000000 1
  230.100000 172.000000 1
  231.100000 34.000000 1
  232.100000 151.000000 1
  233.100000 39.000000 1
  234.100000 177.000000 1
  235.100000 420.000000 1
  236.100000 151.000000 1
  237.100000 150.000000 1
  238.100000 31.000000 1
  239.100000 27.000000 1
  240.100000 73.000000 1
  241.100000 66.000000 1
  242.100000 118.000000 1
  243.100000 105.000000 1
  244.100000 49.000000 1
  245.100000 22.000000 1
  246.100000 111.000000 1
  247.100000 41.000000 1
  248.100000 164.000000 1
  249.100000 57.000000 1
  250.100000 332.000000 1
  251.100000 586.000000 1
  252.100000 287.000000 1
  253.100000 92.000000 1
  254.100000 10.000000 1
  255.100000 70.000000 1
  256.100000 129.000000 1
  257.100000 39.000000 1
  258.100000 124.000000 1
  259.100000 52.000000 1
  260.100000 145.000000 1
  261.100000 89.000000 1
  262.100000 30.000000 1
  263.100000 34.000000 1
  264.100000 366.000000 1
  265.200000 455.000000 1
  266.150000 33249.000000 61
  267.150000 15049.000000 27
  268.150000 4604.000000 8
  269.100000 1164.000000 2
  270.100000 145.000000 1
  271.100000 86.000000 1
  274.100000 78.000000 1
  275.100000 100.000000 1
  276.100000 678.000000 1
  277.100000 313.000000 1
  278.100000 938.000000 2
  279.100000 196.000000 1
  280.100000 284.000000 1
  281.100000 134.000000 1
  283.100000 140.000000 1
  284.100000 60.000000 1
  285.100000 27.000000 1
  286.100000 13.000000 1
  288.100000 58.000000 1
  289.100000 36.000000 1
  290.100000 78.000000 1
  291.100000 52.000000 1
  292.100000 263.000000 1
  293.200000 178.000000 1
  294.150000 7942.000000 15
  295.150000 2296.000000 4
  296.100000 727.000000 1
  297.100000 129.000000 1
  298.100000 74.000000 1
  299.100000 145.000000 1
  300.100000 13.000000 1
  301.100000 129.000000 1
  302.100000 87.000000 1
  303.100000 31.000000 1
  304.100000 63.000000 1
  305.100000 3.000000 1
  306.100000 65.000000 1
  307.100000 49.000000 1
  308.100000 121.000000 1
  309.100000 159.000000 1
  310.100000 404.000000 1
  311.100000 62.000000 1
  312.100000 143.000000 1
  313.100000 22.000000 1
  314.100000 36.000000 1
  315.100000 81.000000 1
  316.100000 71.000000 1
  317.100000 95.000000 1
  318.100000 27.000000 1
  319.100000 13.000000 1
  320.100000 166.000000 1
  321.100000 19.000000 1
  322.100000 55.000000 1
  323.100000 111.000000 1
  325.100000 58.000000 1
  326.100000 52.000000 1
  327.100000 130.000000 1
  328.100000 44.000000 1
  329.100000 119.000000 1
  330.100000 74.000000 1
  332.100000 29.000000 1
  333.100000 110.000000 1
  334.100000 68.000000 1
  335.100000 39.000000 1
  336.100000 63.000000 1
  337.100000 60.000000 1
  338.100000 122.000000 1
  339.100000 55.000000 1
  340.100000 65.000000 1
  341.100000 14.000000 1
  342.100000 57.000000 1
  343.100000 84.000000 1
  344.100000 26.000000 1
  345.100000 42.000000 1
  346.100000 82.000000 1
  347.100000 63.000000 1
  348.100000 156.000000 1
  349.100000 182.000000 1
  350.100000 58.000000 1
  351.100000 22.000000 1
  353.100000 127.000000 1
  354.100000 130.000000 1
  355.100000 41.000000 1
  357.100000 22.000000 1
  360.100000 5.000000 1
  361.100000 74.000000 1
  362.100000 108.000000 1
  363.100000 111.000000 1
  364.100000 161.000000 1
  365.100000 60.000000 1
  366.100000 24.000000 1
  367.100000 30.000000 1
  368.100000 111.000000 1
  369.100000 36.000000 1
  370.100000 14.000000 1
  371.100000 33.000000 1
  372.100000 52.000000 1
  373.100000 172.000000 1
  374.100000 63.000000 1
  375.100000 31.000000 1
  377.100000 95.000000 1
  378.100000 106.000000 1
  379.100000 73.000000 1
  380.100000 46.000000 1
  381.100000 47.000000 1
  382.100000 47.000000 1
  383.100000 11.000000 1
  384.100000 118.000000 1
  385.100000 22.000000 1
  386.100000 5.000000 1
  387.100000 19.000000 1
  388.100000 6.000000 1
  389.100000 30.000000 1
  390.100000 78.000000 1
  391.100000 39.000000 1
  392.100000 31.000000 1
  393.100000 62.000000 1
  394.100000 54.000000 1
  395.100000 49.000000 1
  396.100000 36.000000 1
  397.100000 16.000000 1
  398.100000 5.000000 1
  399.100000 26.000000 1
  400.100000 8.000000 1
  401.100000 79.000000 1
  402.100000 82.000000 1
  403.100000 81.000000 1
  404.100000 33.000000 1
  405.100000 106.000000 1
  406.100000 38.000000 1
  408.100000 44.000000 1
  410.100000 29.000000 1
  411.100000 16.000000 1
  413.100000 74.000000 1
  414.100000 143.000000 1
  415.100000 54.000000 1
  416.100000 5.000000 1
  419.100000 114.000000 1
  420.100000 11.000000 1
  421.100000 105.000000 1
  422.100000 73.000000 1
  423.100000 71.000000 1
  424.100000 60.000000 1
  426.100000 14.000000 1
  427.100000 42.000000 1
  428.100000 19.000000 1
  429.100000 21.000000 1
  431.100000 47.000000 1
  432.100000 44.000000 1
  433.100000 29.000000 1
  434.100000 86.000000 1
  435.100000 21.000000 1
  436.100000 68.000000 1
  437.100000 87.000000 1
  439.100000 89.000000 1
  441.100000 116.000000 1
  442.100000 18.000000 1
  443.100000 2.000000 1
  446.100000 55.000000 1
  447.100000 49.000000 1
  448.100000 54.000000 1
  450.100000 10.000000 1
  451.100000 42.000000 1
  452.100000 70.000000 1
  453.100000 193.000000 1
  454.100000 60.000000 1
  456.100000 70.000000 1
  457.100000 27.000000 1
  458.100000 126.000000 1
  459.100000 24.000000 1
  462.100000 3.000000 1
  464.100000 34.000000 1
  466.100000 34.000000 1
  467.100000 103.000000 1
  468.100000 58.000000 1
  469.100000 102.000000 1
  470.100000 55.000000 1
  471.100000 82.000000 1
  472.100000 87.000000 1
  473.100000 60.000000 1
  474.100000 68.000000 1
  476.100000 74.000000 1
  477.100000 27.000000 1
  478.100000 5.000000 1
  479.100000 42.000000 1
  480.100000 65.000000 1
  481.100000 79.000000 1
  482.100000 2.000000 1
  483.100000 38.000000 1
  484.100000 18.000000 1
  485.100000 52.000000 1
  486.100000 76.000000 1
  487.100000 21.000000 1
  490.100000 58.000000 1
  491.100000 134.000000 1
  492.100000 210.000000 1
  498.100000 30.000000 1
  499.100000 62.000000 1