ACCESSION: MSBNK-GL_Sciences_Inc-GLS00059
RECORD_TITLE: Ketoisoleucine; EI-B; MS; n TMS; RT: 389.00 s
DATE: 2016.01.19 (Created 2012.08.03, modified 2013.07.31)
AUTHORS: Miyagawa H, Akimoto S, Yamasaki K, GL Sciences Inc.
LICENSE: CC BY-SA
COPYRIGHT: GL Sciences Inc.
COMMENT: The chemical compound was chemically modified with N-methyl-N-trimethylsilyl-trifluoroacetamide(MSTFA) before GC-MS analysis. When it has two or more functional groups, this modification gave a mixture of the TMS derivatives having different number of TMS groups at different functional groups.

CH$NAME: Ketoisoleucine
CH$COMPOUND_CLASS: Natural Product
CH$FORMULA: C6H10O3
CH$EXACT_MASS: 130.06299
CH$SMILES: CCC(C)C(=O)C(O)=O
CH$IUPAC: InChI=1S/C6H10O3/c1-3-4(2)5(7)6(8)9/h4H,3H2,1-2H3,(H,8,9)
CH$LINK: CAS 1460-34-0
CH$LINK: CHEBI 28654
CH$LINK: KEGG C03465
CH$LINK: PUBCHEM 6284
CH$LINK: INCHIKEY JVQYSWDUAOAHFM-UHFFFAOYSA-N
CH$LINK: COMPTOX DTXSID50862670

AC$INSTRUMENT: GCMS-2010 Plus, Shimadzu
AC$INSTRUMENT_TYPE: EI-B
AC$MASS_SPECTROMETRY: MS_TYPE MS
AC$MASS_SPECTROMETRY: ION_MODE POSITIVE
AC$MASS_SPECTROMETRY: GAS_PRESSURE 75 kPa
AC$MASS_SPECTROMETRY: ION_SOURCE_TEMPERATURE 200 C
AC$MASS_SPECTROMETRY: SCAN_RANGE_M/Z 85-500
AC$CHROMATOGRAPHY: COLUMN_NAME InertCap 5MS/NP 0.25 mmI.D. x 30 m, df=0.25 um
AC$CHROMATOGRAPHY: INJECTION_TEMPERATURE 230 C
AC$CHROMATOGRAPHY: OVEN_TEMPERATURE 80 C(2 min)-15 C/min - 330C
AC$CHROMATOGRAPHY: RETENTION_INDEX 1185
AC$CHROMATOGRAPHY: RETENTION_TIME 389.00
AC$CHROMATOGRAPHY: TRANSFARLINE_TEMPERATURE 250 C

MS$FOCUSED_ION: DERIVATIVE_TYPE n TMS
MS$DATA_PROCESSING: WHOLE GCMSsolution

PK$SPLASH: splash10-000i-6930000000-7bef6751c4c607393e5e
PK$NUM_PEAK: 342
PK$PEAK: m/z int. rel.int.
  86.050000 7597.000000 53
  87.100000 1514.000000 11
  88.150000 1406.000000 10
  89.050000 144013.000000 999
  90.050000 11969.000000 83
  91.050000 7134.000000 49
  92.100000 658.000000 5
  93.100000 562.000000 4
  94.100000 1638.000000 11
  95.100000 244.000000 2
  96.100000 438.000000 3
  97.100000 791.000000 5
  98.100000 3942.000000 27
  99.050000 8047.000000 56
  100.100000 9780.000000 68
  101.100000 1377.000000 10
  102.100000 751.000000 5
  103.050000 1480.000000 10
  104.100000 295.000000 2
  105.100000 2353.000000 16
  106.100000 188.000000 1
  107.100000 249.000000 2
  108.100000 145.000000 1
  109.100000 401.000000 3
  110.100000 24919.000000 173
  111.100000 2095.000000 15
  112.100000 2449.000000 17
  113.100000 33273.000000 231
  114.150000 27747.000000 192
  115.150000 4486.000000 31
  116.100000 11204.000000 78
  117.100000 6076.000000 42
  118.100000 1201.000000 8
  119.100000 438.000000 3
  120.100000 98.000000 1
  121.100000 34.000000 1
  122.100000 6.000000 1
  123.100000 24.000000 1
  124.100000 62.000000 1
  125.100000 180.000000 1
  126.100000 3598.000000 25
  127.150000 1939.000000 13
  128.100000 2175.000000 15
  129.100000 2066.000000 14
  130.100000 703.000000 5
  131.100000 894.000000 6
  132.100000 86.000000 1
  133.100000 342.000000 2
  134.100000 169.000000 1
  135.100000 177.000000 1
  136.100000 34.000000 1
  137.100000 127.000000 1
  138.100000 222.000000 2
  139.100000 103.000000 1
  140.150000 4264.000000 30
  141.150000 1505.000000 10
  142.150000 1285.000000 9
  143.100000 1226.000000 9
  144.100000 719.000000 5
  145.100000 316.000000 2
  146.100000 186.000000 1
  147.100000 839.000000 6
  148.100000 178.000000 1
  149.100000 305.000000 2
  150.100000 70.000000 1
  151.100000 50.000000 1
  153.100000 82.000000 1
  154.100000 1804.000000 13
  155.200000 354.000000 2
  156.200000 6190.000000 43
  157.150000 1118.000000 8
  158.100000 2678.000000 19
  159.100000 449.000000 3
  160.100000 284.000000 2
  161.100000 145.000000 1
  162.100000 86.000000 1
  164.100000 66.000000 1
  165.100000 34.000000 1
  166.100000 242.000000 2
  167.100000 66.000000 1
  168.100000 137.000000 1
  169.100000 73.000000 1
  170.100000 239.000000 2
  171.100000 118.000000 1
  172.100000 25569.000000 177
  173.100000 3514.000000 24
  174.100000 1742.000000 12
  175.100000 166.000000 1
  176.100000 86.000000 1
  177.100000 26.000000 1
  178.100000 180.000000 1
  180.100000 86.000000 1
  181.100000 10.000000 1
  182.100000 278.000000 2
  183.100000 231.000000 2
  184.100000 1073.000000 7
  185.100000 279.000000 2
  186.100000 222.000000 2
  187.100000 102.000000 1
  188.100000 244.000000 2
  189.100000 51820.000000 359
  190.050000 6527.000000 45
  191.000000 2380.000000 17
  192.000000 258.000000 2
  193.000000 103.000000 1
  194.000000 27.000000 1
  195.000000 63.000000 1
  196.000000 57.000000 1
  197.000000 33.000000 1
  198.000000 148.000000 1
  199.100000 114.000000 1
  200.100000 44310.000000 307
  201.100000 6569.000000 46
  202.150000 2240.000000 16
  203.100000 20386.000000 141
  204.150000 2895.000000 20
  205.100000 1260.000000 9
  206.100000 225.000000 2
  207.100000 575.000000 4
  208.100000 188.000000 1
  209.100000 13.000000 1
  211.100000 100.000000 1
  212.100000 71.000000 1
  214.100000 106.000000 1
  215.100000 66.000000 1
  216.100000 7278.000000 50
  217.050000 1293.000000 9
  218.100000 316.000000 2
  219.100000 644.000000 4
  221.100000 82.000000 1
  222.100000 100.000000 1
  223.100000 102.000000 1
  224.100000 98.000000 1
  225.100000 18.000000 1
  226.100000 38.000000 1
  227.100000 74.000000 1
  228.100000 26.000000 1
  229.100000 106.000000 1
  230.100000 54.000000 1
  231.100000 19.000000 1
  232.100000 188.000000 1
  234.100000 159.000000 1
  235.100000 92.000000 1
  236.100000 60.000000 1
  237.100000 97.000000 1
  238.100000 121.000000 1
  239.100000 92.000000 1
  240.100000 2.000000 1
  241.100000 34.000000 1
  242.100000 65.000000 1
  243.100000 62.000000 1
  244.100000 42.000000 1
  245.100000 52.000000 1
  247.100000 60.000000 1
  248.100000 130.000000 1
  249.100000 103.000000 1
  250.100000 94.000000 1
  251.100000 63.000000 1
  252.100000 121.000000 1
  253.100000 356.000000 2
  254.100000 113.000000 1
  255.100000 119.000000 1
  256.100000 57.000000 1
  257.100000 111.000000 1
  258.100000 98.000000 1
  259.100000 62.000000 1
  260.100000 73.000000 1
  261.100000 126.000000 1
  262.100000 50.000000 1
  263.100000 127.000000 1
  264.100000 98.000000 1
  265.100000 154.000000 1
  266.100000 24.000000 1
  267.100000 92.000000 1
  268.100000 63.000000 1
  269.100000 36.000000 1
  270.100000 71.000000 1
  273.100000 6.000000 1
  274.100000 30.000000 1
  275.100000 47.000000 1
  277.100000 14.000000 1
  278.100000 6.000000 1
  279.100000 26.000000 1
  280.100000 79.000000 1
  281.100000 940.000000 7
  282.100000 332.000000 2
  283.100000 150.000000 1
  285.100000 3.000000 1
  286.100000 113.000000 1
  287.100000 76.000000 1
  288.100000 46.000000 1
  289.100000 44.000000 1
  290.100000 3.000000 1
  292.100000 118.000000 1
  293.100000 79.000000 1
  294.100000 18.000000 1
  295.100000 29.000000 1
  296.100000 68.000000 1
  298.100000 54.000000 1
  299.100000 31.000000 1
  300.100000 63.000000 1
  301.100000 26.000000 1
  302.100000 8.000000 1
  304.100000 6.000000 1
  305.100000 55.000000 1
  307.100000 57.000000 1
  309.100000 70.000000 1
  310.100000 3.000000 1
  311.100000 121.000000 1
  312.100000 33.000000 1
  313.100000 21.000000 1
  315.100000 78.000000 1
  316.100000 49.000000 1
  319.100000 18.000000 1
  321.100000 11.000000 1
  322.100000 90.000000 1
  326.100000 14.000000 1
  327.100000 118.000000 1
  328.100000 66.000000 1
  331.100000 236.000000 2
  332.100000 39.000000 1
  333.100000 62.000000 1
  336.100000 127.000000 1
  337.100000 50.000000 1
  339.100000 71.000000 1
  341.100000 122.000000 1
  342.100000 180.000000 1
  343.100000 95.000000 1
  344.100000 57.000000 1
  346.100000 202.000000 1
  347.100000 82.000000 1
  349.100000 8.000000 1
  351.100000 113.000000 1
  352.100000 100.000000 1
  353.100000 76.000000 1
  354.100000 2.000000 1
  356.100000 97.000000 1
  357.100000 87.000000 1
  358.100000 55.000000 1
  359.100000 16.000000 1
  360.100000 82.000000 1
  361.100000 24.000000 1
  362.100000 38.000000 1
  363.100000 78.000000 1
  364.100000 2.000000 1
  365.100000 46.000000 1
  366.100000 38.000000 1
  367.100000 63.000000 1
  369.100000 146.000000 1
  370.100000 140.000000 1
  371.100000 122.000000 1
  372.100000 29.000000 1
  373.100000 60.000000 1
  376.100000 24.000000 1
  377.100000 110.000000 1
  378.100000 65.000000 1
  379.100000 73.000000 1
  380.100000 22.000000 1
  381.100000 57.000000 1
  382.100000 6.000000 1
  385.100000 55.000000 1
  387.100000 63.000000 1
  388.100000 79.000000 1
  389.100000 21.000000 1
  392.100000 29.000000 1
  395.100000 60.000000 1
  396.100000 55.000000 1
  397.100000 44.000000 1
  400.100000 27.000000 1
  401.100000 10.000000 1
  402.100000 22.000000 1
  403.100000 16.000000 1
  405.100000 127.000000 1
  406.100000 126.000000 1
  407.100000 46.000000 1
  409.100000 11.000000 1
  410.100000 30.000000 1
  411.100000 71.000000 1
  412.100000 98.000000 1
  413.100000 11.000000 1
  414.100000 11.000000 1
  415.100000 78.000000 1
  420.100000 39.000000 1
  423.100000 26.000000 1
  428.100000 29.000000 1
  432.100000 52.000000 1
  433.100000 39.000000 1
  435.100000 31.000000 1
  436.100000 21.000000 1
  437.100000 31.000000 1
  438.100000 57.000000 1
  439.100000 22.000000 1
  440.100000 68.000000 1
  441.100000 47.000000 1
  442.100000 95.000000 1
  443.100000 44.000000 1
  444.100000 39.000000 1
  445.100000 14.000000 1
  446.100000 2.000000 1
  447.100000 42.000000 1
  448.100000 6.000000 1
  449.100000 13.000000 1
  450.100000 79.000000 1
  451.100000 63.000000 1
  453.100000 49.000000 1
  454.100000 102.000000 1
  455.100000 94.000000 1
  456.100000 41.000000 1
  457.100000 71.000000 1
  458.100000 62.000000 1
  459.100000 26.000000 1
  460.100000 27.000000 1
  461.100000 102.000000 1
  462.100000 18.000000 1
  464.100000 6.000000 1
  465.100000 63.000000 1
  466.100000 29.000000 1
  470.100000 34.000000 1
  471.100000 18.000000 1
  472.100000 74.000000 1
  474.100000 16.000000 1
  476.100000 76.000000 1
  477.100000 78.000000 1
  478.100000 84.000000 1
  479.100000 124.000000 1
  480.100000 185.000000 1
  481.100000 113.000000 1
  482.100000 170.000000 1
  484.100000 22.000000 1
  485.100000 29.000000 1
  487.100000 70.000000 1
  488.100000 31.000000 1
  489.100000 81.000000 1
  490.100000 106.000000 1
  491.100000 103.000000 1
  493.100000 58.000000 1
  494.100000 116.000000 1
  495.100000 2.000000 1
  496.100000 27.000000 1
  497.100000 92.000000 1
  498.100000 52.000000 1
  499.100000 13.000000 1