ACCESSION: MSBNK-GL_Sciences_Inc-GLS00064
RECORD_TITLE: Maleamic acid; EI-B; MS; n TMS; RT: 549.31 s
DATE: 2016.01.19 (Created 2012.08.03, modified 2013.07.31)
AUTHORS: Miyagawa H, Akimoto S, Yamasaki K, GL Sciences Inc.
LICENSE: CC BY-SA
COPYRIGHT: GL Sciences Inc.
COMMENT: The chemical compound was chemically modified with N-methyl-N-trimethylsilyl-trifluoroacetamide(MSTFA) before GC-MS analysis. When it has two or more functional groups, this modification gave a mixture of the TMS derivatives having different number of TMS groups at different functional groups.

CH$NAME: Maleamic acid
CH$COMPOUND_CLASS: Natural Product
CH$FORMULA: C4H5NO3
CH$EXACT_MASS: 115.02694
CH$SMILES: NC(=O)C=CC(O)=O
CH$IUPAC: InChI=1S/C4H5NO3/c5-3(6)1-2-4(7)8/h1-2H,(H2,5,6)(H,7,8)/b2-1-
CH$LINK: CAS 557-24-4
CH$LINK: CHEBI 29045
CH$LINK: KEGG C01596
CH$LINK: PUBCHEM 4751
CH$LINK: INCHIKEY FSQQTNAZHBEJLS-UPHRSURJSA-N

AC$INSTRUMENT: GCMS-2010 Plus, Shimadzu
AC$INSTRUMENT_TYPE: EI-B
AC$MASS_SPECTROMETRY: MS_TYPE MS
AC$MASS_SPECTROMETRY: ION_MODE POSITIVE
AC$MASS_SPECTROMETRY: GAS_PRESSURE 75 kPa
AC$MASS_SPECTROMETRY: ION_SOURCE_TEMPERATURE 200 C
AC$MASS_SPECTROMETRY: SCAN_RANGE_M/Z 85-500
AC$CHROMATOGRAPHY: COLUMN_NAME InertCap 5MS/NP 0.25 mmI.D. x 30 m, df=0.25 um
AC$CHROMATOGRAPHY: INJECTION_TEMPERATURE 230 C
AC$CHROMATOGRAPHY: OVEN_TEMPERATURE 80 C(2 min)-15 C/min - 330C
AC$CHROMATOGRAPHY: RETENTION_INDEX 1445
AC$CHROMATOGRAPHY: RETENTION_TIME 549.31
AC$CHROMATOGRAPHY: TRANSFARLINE_TEMPERATURE 250 C

MS$FOCUSED_ION: DERIVATIVE_TYPE n TMS
MS$DATA_PROCESSING: WHOLE GCMSsolution

PK$SPLASH: splash10-0002-0920000000-111c9af85e446f709f78
PK$NUM_PEAK: 355
PK$PEAK: m/z int. rel.int.
  86.000000 1519.000000 99
  87.000000 281.000000 18
  88.000000 198.000000 13
  89.000000 530.000000 34
  90.000000 66.000000 4
  91.000000 170.000000 11
  92.000000 132.000000 9
  93.000000 119.000000 8
  94.000000 102.000000 7
  95.000000 71.000000 5
  96.000000 166.000000 11
  97.000000 204.000000 13
  98.000000 534.000000 35
  99.000000 366.000000 24
  100.100000 1407.000000 91
  101.100000 257.000000 17
  102.100000 316.000000 21
  103.100000 151.000000 10
  105.100000 108.000000 7
  106.100000 103.000000 7
  107.100000 84.000000 5
  108.100000 31.000000 2
  109.100000 60.000000 4
  110.100000 186.000000 12
  111.100000 126.000000 8
  112.100000 380.000000 25
  113.100000 185.000000 12
  114.100000 361.000000 23
  115.100000 418.000000 27
  116.100000 372.000000 24
  117.100000 401.000000 26
  118.100000 154.000000 10
  119.100000 327.000000 21
  120.100000 73.000000 5
  121.100000 73.000000 5
  122.100000 74.000000 5
  124.100000 134.000000 9
  125.100000 71.000000 5
  126.100000 518.000000 34
  127.100000 298.000000 19
  128.100000 209.000000 14
  129.100000 393.000000 26
  130.100000 239.000000 16
  131.100000 1004.000000 65
  132.100000 412.000000 27
  133.100000 958.000000 62
  134.100000 166.000000 11
  135.100000 103.000000 7
  136.100000 49.000000 3
  138.100000 42.000000 3
  139.100000 31.000000 2
  140.100000 118.000000 8
  141.100000 742.000000 48
  142.150000 4408.000000 286
  143.100000 628.000000 41
  144.100000 332.000000 22
  145.100000 182.000000 12
  146.200000 318.000000 21
  147.150000 15381.000000 999
  148.200000 2396.000000 156
  149.150000 1939.000000 126
  150.200000 271.000000 18
  151.200000 207.000000 13
  152.200000 135.000000 9
  153.200000 34.000000 2
  154.150000 1485.000000 96
  155.100000 999.000000 65
  156.100000 391.000000 25
  157.100000 266.000000 17
  158.100000 247.000000 16
  159.100000 110.000000 7
  160.100000 127.000000 8
  161.100000 154.000000 10
  162.100000 30.000000 2
  163.100000 68.000000 4
  164.100000 50.000000 3
  165.100000 55.000000 4
  166.100000 81.000000 5
  167.100000 100.000000 6
  168.100000 34.000000 2
  169.100000 1710.000000 111
  170.100000 556.000000 36
  171.100000 305.000000 20
  172.100000 377.000000 24
  173.200000 108.000000 7
  174.150000 4694.000000 305
  175.200000 729.000000 47
  176.200000 380.000000 25
  177.200000 78.000000 5
  178.200000 68.000000 4
  179.200000 102.000000 7
  180.200000 103.000000 7
  181.200000 94.000000 6
  182.200000 42.000000 3
  184.200000 29.000000 2
  185.200000 158.000000 10
  186.200000 18.000000 1
  187.200000 146.000000 9
  188.200000 10.000000 1
  189.200000 42.000000 3
  190.200000 10.000000 1
  191.200000 47.000000 3
  192.200000 94.000000 6
  193.200000 70.000000 5
  194.200000 2.000000 1
  195.200000 204.000000 13
  196.200000 34.000000 2
  198.200000 11.000000 1
  199.200000 33.000000 2
  200.200000 249.000000 16
  201.200000 58.000000 4
  202.200000 84.000000 5
  203.200000 39.000000 3
  204.200000 49.000000 3
  205.200000 42.000000 3
  206.200000 54.000000 4
  207.200000 415.000000 27
  208.200000 177.000000 11
  209.200000 57.000000 4
  210.200000 106.000000 7
  211.200000 49.000000 3
  212.200000 16.000000 1
  213.200000 94.000000 6
  214.200000 537.000000 35
  215.200000 140.000000 9
  216.200000 191.000000 12
  218.200000 175.000000 11
  219.200000 367.000000 24
  220.200000 113.000000 7
  221.200000 49.000000 3
  222.200000 34.000000 2
  223.200000 50.000000 3
  224.200000 38.000000 2
  225.200000 102.000000 7
  226.200000 95.000000 6
  228.050000 2303.000000 150
  229.100000 559.000000 36
  230.100000 241.000000 16
  231.100000 39.000000 3
  233.100000 26.000000 2
  235.100000 142.000000 9
  236.100000 73.000000 5
  237.100000 81.000000 5
  238.100000 65.000000 4
  239.100000 122.000000 8
  240.100000 47.000000 3
  241.100000 50.000000 3
  242.100000 180.000000 12
  243.100000 26.000000 2
  244.150000 3785.000000 246
  245.100000 1060.000000 69
  246.100000 497.000000 32
  247.100000 148.000000 10
  248.100000 29.000000 2
  249.100000 74.000000 5
  250.100000 106.000000 7
  252.100000 57.000000 4
  253.100000 673.000000 44
  254.100000 145.000000 9
  255.100000 199.000000 13
  256.100000 55.000000 4
  257.100000 106.000000 7
  258.100000 3.000000 1
  259.100000 226.000000 15
  260.100000 129.000000 8
  262.100000 63.000000 4
  263.100000 10.000000 1
  264.100000 220.000000 14
  265.100000 148.000000 10
  267.100000 55.000000 4
  268.100000 92.000000 6
  269.100000 103.000000 7
  270.100000 102.000000 7
  271.100000 92.000000 6
  272.100000 79.000000 5
  273.100000 71.000000 5
  274.100000 130.000000 8
  275.100000 39.000000 3
  276.100000 29.000000 2
  277.100000 97.000000 6
  279.100000 8.000000 1
  280.100000 11.000000 1
  281.100000 148.000000 10
  282.100000 103.000000 7
  283.100000 106.000000 7
  284.100000 97.000000 6
  286.100000 24.000000 2
  288.100000 73.000000 5
  290.100000 30.000000 2
  291.100000 129.000000 8
  292.100000 76.000000 5
  293.100000 16.000000 1
  295.100000 34.000000 2
  296.100000 111.000000 7
  297.100000 21.000000 1
  298.100000 2.000000 1
  299.100000 26.000000 2
  300.100000 78.000000 5
  303.100000 84.000000 5
  305.100000 79.000000 5
  306.100000 95.000000 6
  307.100000 13.000000 1
  309.100000 5.000000 1
  310.100000 118.000000 8
  311.100000 36.000000 2
  312.100000 98.000000 6
  313.100000 22.000000 1
  315.100000 70.000000 5
  316.100000 54.000000 4
  317.100000 26.000000 2
  319.100000 5.000000 1
  320.100000 42.000000 3
  321.100000 142.000000 9
  322.100000 18.000000 1
  323.100000 84.000000 5
  324.100000 22.000000 1
  326.100000 19.000000 1
  327.100000 166.000000 11
  328.100000 58.000000 4
  329.100000 18.000000 1
  330.100000 29.000000 2
  331.100000 148.000000 10
  332.100000 14.000000 1
  333.100000 70.000000 5
  334.100000 79.000000 5
  335.100000 105.000000 7
  336.100000 24.000000 2
  337.100000 82.000000 5
  339.100000 24.000000 2
  340.100000 49.000000 3
  341.100000 102.000000 7
  344.100000 29.000000 2
  345.100000 78.000000 5
  346.100000 194.000000 13
  347.100000 36.000000 2
  348.100000 150.000000 10
  349.100000 76.000000 5
  350.100000 130.000000 8
  353.100000 71.000000 5
  354.100000 33.000000 2
  355.100000 66.000000 4
  357.100000 49.000000 3
  359.100000 108.000000 7
  361.100000 19.000000 1
  362.100000 73.000000 5
  363.100000 52.000000 3
  364.100000 111.000000 7
  365.100000 98.000000 6
  366.100000 49.000000 3
  367.100000 3.000000 1
  368.100000 21.000000 1
  369.100000 16.000000 1
  370.100000 38.000000 2
  371.100000 13.000000 1
  372.100000 21.000000 1
  373.100000 16.000000 1
  374.100000 84.000000 5
  375.100000 47.000000 3
  377.100000 27.000000 2
  379.100000 3.000000 1
  380.100000 8.000000 1
  383.100000 122.000000 8
  384.100000 89.000000 6
  385.100000 86.000000 6
  388.100000 55.000000 4
  389.100000 63.000000 4
  390.100000 82.000000 5
  391.100000 71.000000 5
  392.100000 60.000000 4
  393.100000 156.000000 10
  394.100000 138.000000 9
  395.100000 95.000000 6
  397.100000 30.000000 2
  398.100000 38.000000 2
  400.100000 26.000000 2
  401.100000 30.000000 2
  403.100000 126.000000 8
  404.100000 148.000000 10
  405.100000 159.000000 10
  406.100000 76.000000 5
  407.100000 82.000000 5
  408.100000 66.000000 4
  409.100000 140.000000 9
  410.100000 118.000000 8
  411.100000 55.000000 4
  412.100000 33.000000 2
  415.100000 102.000000 7
  416.100000 42.000000 3
  417.100000 66.000000 4
  418.100000 3.000000 1
  419.100000 29.000000 2
  420.100000 42.000000 3
  421.100000 63.000000 4
  422.100000 52.000000 3
  423.100000 52.000000 3
  425.100000 24.000000 2
  427.100000 21.000000 1
  428.100000 54.000000 4
  429.100000 55.000000 4
  430.100000 100.000000 6
  431.100000 44.000000 3
  432.100000 47.000000 3
  434.100000 8.000000 1
  435.100000 70.000000 5
  438.100000 36.000000 2
  439.100000 2.000000 1
  440.100000 27.000000 2
  441.100000 58.000000 4
  442.100000 33.000000 2
  443.100000 47.000000 3
  444.100000 73.000000 5
  445.100000 54.000000 4
  447.100000 21.000000 1
  448.100000 42.000000 3
  449.100000 97.000000 6
  451.100000 58.000000 4
  452.100000 13.000000 1
  453.100000 60.000000 4
  454.100000 31.000000 2
  455.100000 98.000000 6
  456.100000 39.000000 3
  457.100000 41.000000 3
  459.100000 57.000000 4
  460.100000 14.000000 1
  461.100000 46.000000 3
  463.100000 106.000000 7
  464.100000 129.000000 8
  465.100000 65.000000 4
  466.100000 31.000000 2
  467.100000 49.000000 3
  468.100000 54.000000 4
  469.100000 191.000000 12
  470.100000 102.000000 7
  471.100000 26.000000 2
  473.100000 66.000000 4
  474.100000 42.000000 3
  475.100000 102.000000 7
  476.100000 16.000000 1
  477.100000 145.000000 9
  478.100000 81.000000 5
  479.100000 27.000000 2
  481.100000 26.000000 2
  483.100000 33.000000 2
  484.100000 132.000000 9
  486.100000 34.000000 2
  488.100000 24.000000 2
  489.100000 90.000000 6
  491.100000 140.000000 9
  493.100000 82.000000 5
  494.100000 193.000000 13
  495.100000 63.000000 4
  496.100000 124.000000 8
  497.100000 34.000000 2
  498.100000 94.000000 6
  499.100000 118.000000 8