ACCESSION: MSBNK-GL_Sciences_Inc-GLS00070
RECORD_TITLE: 2-Methylglutaric acid; EI-B; MS; 2 TMS; RT: 535.17 s
DATE: 2016.01.19 (Created 2012.08.03, modified 2013.07.31)
AUTHORS: Miyagawa H, Akimoto S, Yamasaki K, GL Sciences Inc.
LICENSE: CC BY-SA
COPYRIGHT: GL Sciences Inc.
COMMENT: The chemical compound was chemically modified with N-methyl-N-trimethylsilyl-trifluoroacetamide(MSTFA) before GC-MS analysis. When it has two or more functional groups, this modification gave a mixture of the TMS derivatives having different number of TMS groups at different functional groups.

CH$NAME: 2-Methylglutaric acid
CH$NAME: 2-Methylglutarate
CH$COMPOUND_CLASS: Natural Product
CH$FORMULA: C6H10O4
CH$EXACT_MASS: 146.05791
CH$SMILES: OC(=O)CC(C)CC(O)=O
CH$IUPAC: InChI=1S/C6H10O4/c1-4(2-5(7)8)3-6(9)10/h4H,2-3H2,1H3,(H,7,8)(H,9,10)
CH$LINK: CAS 617-62-9
CH$LINK: INCHIKEY XJMMNTGIMDZPMU-UHFFFAOYSA-N
CH$LINK: COMPTOX DTXSID50211649

AC$INSTRUMENT: GCMS-2010 Plus, Shimadzu
AC$INSTRUMENT_TYPE: EI-B
AC$MASS_SPECTROMETRY: MS_TYPE MS
AC$MASS_SPECTROMETRY: ION_MODE POSITIVE
AC$MASS_SPECTROMETRY: GAS_PRESSURE 75 kPa
AC$MASS_SPECTROMETRY: ION_SOURCE_TEMPERATURE 200 C
AC$MASS_SPECTROMETRY: SCAN_RANGE_M/Z 85-500
AC$CHROMATOGRAPHY: COLUMN_NAME InertCap 5MS/NP 0.25 mmI.D. x 30 m, df=0.25 um
AC$CHROMATOGRAPHY: INJECTION_TEMPERATURE 230 C
AC$CHROMATOGRAPHY: OVEN_TEMPERATURE 80 C(2 min)-15 C/min - 330C
AC$CHROMATOGRAPHY: RETENTION_INDEX 1419
AC$CHROMATOGRAPHY: RETENTION_TIME 535.17
AC$CHROMATOGRAPHY: TRANSFARLINE_TEMPERATURE 250 C

MS$FOCUSED_ION: DERIVATIVE_TYPE 2 TMS
MS$DATA_PROCESSING: WHOLE GCMSsolution

PK$SPLASH: splash10-0002-0930000000-fbddcb97da0458138e6b
PK$NUM_PEAK: 372
PK$PEAK: m/z int. rel.int.
  86.050000 22330.000000 45
  87.050000 5766.000000 12
  88.050000 6209.000000 12
  89.050000 5954.000000 12
  90.000000 841.000000 2
  91.050000 1524.000000 3
  92.000000 194.000000 1
  93.000000 530.000000 1
  94.000000 119.000000 1
  95.000000 1284.000000 3
  96.000000 321.000000 1
  97.050000 1808.000000 4
  98.100000 959.000000 2
  99.100000 9542.000000 19
  100.050000 1963.000000 4
  101.050000 10914.000000 22
  102.050000 2359.000000 5
  103.050000 3715.000000 7
  104.000000 687.000000 1
  105.000000 1834.000000 4
  106.000000 289.000000 1
  107.000000 175.000000 1
  108.000000 102.000000 1
  109.000000 1388.000000 3
  110.050000 1234.000000 2
  111.050000 14878.000000 30
  112.100000 1967.000000 4
  113.100000 18978.000000 38
  114.150000 2972.000000 6
  115.050000 9586.000000 19
  116.050000 28509.000000 57
  117.100000 31308.000000 63
  118.050000 3817.000000 8
  119.050000 3360.000000 7
  120.000000 423.000000 1
  121.000000 178.000000 1
  122.000000 116.000000 1
  123.000000 290.000000 1
  124.000000 105.000000 1
  125.000000 881.000000 2
  126.000000 268.000000 1
  127.100000 1610.000000 3
  128.150000 2923.000000 6
  129.100000 57729.000000 116
  130.100000 63055.000000 127
  131.050000 32639.000000 66
  132.150000 5784.000000 12
  133.050000 34442.000000 69
  134.050000 4640.000000 9
  135.100000 3439.000000 7
  136.100000 362.000000 1
  137.100000 137.000000 1
  138.100000 66.000000 1
  139.100000 417.000000 1
  140.100000 36.000000 1
  141.150000 3334.000000 7
  142.150000 1592.000000 3
  143.100000 35799.000000 72
  144.150000 59500.000000 120
  145.150000 14338.000000 29
  146.150000 35762.000000 72
  147.100000 497126.000000 999
  148.150000 79906.000000 161
  149.100000 138759.000000 279
  150.100000 17524.000000 35
  151.100000 8946.000000 18
  152.100000 908.000000 2
  153.100000 279.000000 1
  154.100000 98.000000 1
  155.100000 431.000000 1
  156.150000 1646.000000 3
  157.100000 95062.000000 191
  158.100000 12308.000000 25
  159.100000 12055.000000 24
  160.100000 1226.000000 2
  161.100000 655.000000 1
  162.100000 14223.000000 29
  163.100000 5514.000000 11
  164.100000 1828.000000 4
  165.100000 1345.000000 3
  166.100000 238.000000 1
  167.100000 175.000000 1
  168.100000 34.000000 1
  169.100000 338.000000 1
  170.100000 391.000000 1
  171.150000 2190.000000 4
  172.100000 169537.000000 341
  173.100000 35727.000000 72
  174.100000 9266.000000 19
  175.100000 1689.000000 3
  176.100000 302.000000 1
  177.100000 281.000000 1
  178.100000 150.000000 1
  179.100000 212.000000 1
  180.100000 95.000000 1
  181.100000 14.000000 1
  182.100000 13.000000 1
  183.100000 169.000000 1
  184.000000 170.000000 1
  185.000000 1588.000000 3
  186.000000 193.000000 1
  187.000000 250.000000 1
  188.100000 230.000000 1
  189.050000 35653.000000 72
  190.050000 7697.000000 15
  191.050000 3136.000000 6
  192.000000 708.000000 1
  193.000000 265.000000 1
  194.000000 132.000000 1
  195.000000 44.000000 1
  196.000000 76.000000 1
  197.000000 49.000000 1
  198.000000 57.000000 1
  199.100000 610.000000 1
  200.050000 28244.000000 57
  201.050000 13035.000000 26
  202.150000 2888.000000 6
  203.100000 9172.000000 18
  204.100000 136702.000000 275
  205.100000 28326.000000 57
  206.050000 10688.000000 21
  207.050000 1943.000000 4
  208.100000 302.000000 1
  209.100000 284.000000 1
  210.100000 66.000000 1
  213.100000 127.000000 1
  214.100000 126.000000 1
  215.100000 487.000000 1
  216.100000 193.000000 1
  217.100000 15959.000000 32
  218.100000 15425.000000 31
  219.050000 6062.000000 12
  220.100000 1308.000000 3
  221.100000 386.000000 1
  222.100000 153.000000 1
  223.100000 18.000000 1
  224.100000 57.000000 1
  225.100000 214.000000 1
  226.100000 34.000000 1
  227.100000 84.000000 1
  228.100000 55.000000 1
  229.100000 42.000000 1
  230.150000 1141.000000 2
  231.100000 96266.000000 193
  232.050000 20115.000000 40
  233.050000 9217.000000 19
  234.100000 1698.000000 3
  235.100000 377.000000 1
  236.100000 110.000000 1
  237.100000 21.000000 1
  238.100000 68.000000 1
  239.100000 11.000000 1
  240.100000 100.000000 1
  242.100000 54.000000 1
  243.100000 13.000000 1
  244.100000 65.000000 1
  245.100000 161.000000 1
  246.100000 462.000000 1
  247.100000 90106.000000 181
  248.150000 19429.000000 39
  249.100000 8454.000000 17
  250.100000 1062.000000 2
  251.100000 215.000000 1
  252.100000 44.000000 1
  253.100000 246.000000 1
  254.100000 140.000000 1
  255.100000 86.000000 1
  256.100000 65.000000 1
  257.100000 8.000000 1
  258.100000 106.000000 1
  259.100000 154.000000 1
  260.100000 158.000000 1
  261.100000 79.000000 1
  262.100000 377.000000 1
  263.100000 47.000000 1
  264.100000 180.000000 1
  265.100000 138.000000 1
  268.100000 106.000000 1
  269.100000 5.000000 1
  270.100000 38.000000 1
  271.100000 30.000000 1
  272.100000 68.000000 1
  273.100000 169.000000 1
  274.100000 414.000000 1
  275.100000 146967.000000 295
  276.100000 35052.000000 70
  277.050000 13788.000000 28
  278.100000 2068.000000 4
  279.100000 702.000000 1
  280.100000 106.000000 1
  281.100000 29.000000 1
  282.100000 65.000000 1
  283.100000 50.000000 1
  287.100000 78.000000 1
  288.100000 42.000000 1
  289.100000 217.000000 1
  290.100000 290.000000 1
  291.100000 370.000000 1
  292.100000 186.000000 1
  293.100000 54.000000 1
  294.100000 19.000000 1
  295.100000 19.000000 1
  296.100000 42.000000 1
  298.100000 114.000000 1
  300.100000 27.000000 1
  301.100000 98.000000 1
  303.100000 146.000000 1
  304.100000 98.000000 1
  305.100000 70.000000 1
  307.100000 238.000000 1
  308.100000 73.000000 1
  309.100000 202.000000 1
  310.100000 102.000000 1
  312.100000 81.000000 1
  313.100000 84.000000 1
  314.100000 76.000000 1
  315.100000 49.000000 1
  316.100000 103.000000 1
  317.100000 68.000000 1
  318.100000 47.000000 1
  319.100000 52.000000 1
  320.100000 90.000000 1
  322.100000 119.000000 1
  323.100000 54.000000 1
  324.100000 39.000000 1
  326.100000 65.000000 1
  327.100000 143.000000 1
  328.100000 222.000000 1
  329.100000 86.000000 1
  330.100000 78.000000 1
  331.100000 68.000000 1
  332.100000 119.000000 1
  333.100000 70.000000 1
  334.100000 5.000000 1
  335.100000 65.000000 1
  336.100000 46.000000 1
  337.100000 106.000000 1
  338.100000 52.000000 1
  339.100000 73.000000 1
  340.100000 148.000000 1
  341.100000 62.000000 1
  342.100000 84.000000 1
  343.100000 74.000000 1
  344.100000 98.000000 1
  345.100000 41.000000 1
  346.100000 138.000000 1
  347.100000 97.000000 1
  348.100000 103.000000 1
  349.100000 16.000000 1
  350.100000 8.000000 1
  352.100000 3.000000 1
  353.100000 52.000000 1
  354.100000 66.000000 1
  356.100000 119.000000 1
  358.100000 39.000000 1
  359.100000 42.000000 1
  362.100000 110.000000 1
  363.100000 271.000000 1
  364.100000 132.000000 1
  365.100000 47.000000 1
  366.100000 50.000000 1
  367.100000 6.000000 1
  368.100000 8.000000 1
  369.100000 60.000000 1
  370.100000 130.000000 1
  372.100000 8.000000 1
  373.100000 38.000000 1
  374.100000 87.000000 1
  376.100000 5.000000 1
  377.100000 108.000000 1
  378.100000 50.000000 1
  379.100000 71.000000 1
  382.100000 24.000000 1
  383.100000 74.000000 1
  384.100000 52.000000 1
  386.100000 13.000000 1
  388.100000 103.000000 1
  389.100000 16.000000 1
  390.100000 102.000000 1
  391.100000 41.000000 1
  392.100000 70.000000 1
  393.100000 6.000000 1
  394.100000 27.000000 1
  395.100000 14.000000 1
  396.100000 41.000000 1
  398.100000 102.000000 1
  400.100000 60.000000 1
  402.100000 42.000000 1
  403.100000 49.000000 1
  404.100000 5.000000 1
  405.100000 87.000000 1
  406.100000 10.000000 1
  407.100000 2.000000 1
  408.100000 46.000000 1
  409.100000 84.000000 1
  410.100000 57.000000 1
  411.100000 70.000000 1
  412.100000 122.000000 1
  414.100000 105.000000 1
  415.100000 34.000000 1
  416.100000 113.000000 1
  417.100000 110.000000 1
  418.100000 110.000000 1
  420.100000 29.000000 1
  421.100000 18.000000 1
  422.100000 63.000000 1
  423.100000 2.000000 1
  424.100000 30.000000 1
  425.100000 142.000000 1
  426.100000 82.000000 1
  427.100000 114.000000 1
  429.100000 29.000000 1
  430.100000 44.000000 1
  431.100000 116.000000 1
  432.100000 68.000000 1
  433.100000 146.000000 1
  434.100000 36.000000 1
  435.100000 76.000000 1
  437.100000 223.000000 1
  438.100000 62.000000 1
  439.100000 217.000000 1
  440.100000 52.000000 1
  441.100000 44.000000 1
  442.100000 100.000000 1
  443.100000 92.000000 1
  444.100000 81.000000 1
  445.100000 90.000000 1
  446.100000 24.000000 1
  447.100000 145.000000 1
  448.100000 5.000000 1
  449.100000 111.000000 1
  450.100000 63.000000 1
  451.100000 57.000000 1
  452.100000 33.000000 1
  453.100000 33.000000 1
  454.100000 18.000000 1
  456.100000 19.000000 1
  457.100000 16.000000 1
  458.100000 24.000000 1
  459.100000 68.000000 1
  460.100000 41.000000 1
  462.100000 13.000000 1
  464.100000 114.000000 1
  465.100000 94.000000 1
  466.100000 73.000000 1
  468.100000 14.000000 1
  469.100000 50.000000 1
  470.100000 47.000000 1
  471.100000 63.000000 1
  472.100000 97.000000 1
  473.100000 33.000000 1
  474.100000 87.000000 1
  476.100000 49.000000 1
  477.100000 154.000000 1
  478.100000 46.000000 1
  480.100000 31.000000 1
  481.100000 41.000000 1
  482.100000 54.000000 1
  483.100000 94.000000 1
  486.100000 24.000000 1
  487.100000 78.000000 1
  488.100000 65.000000 1
  490.100000 62.000000 1
  491.100000 87.000000 1
  492.100000 3.000000 1
  493.100000 97.000000 1
  494.100000 27.000000 1
  495.100000 57.000000 1
  496.100000 78.000000 1
  497.100000 26.000000 1
  498.100000 52.000000 1
  499.100000 73.000000 1