ACCESSION: MSBNK-GL_Sciences_Inc-GLS00073
RECORD_TITLE: D-3-Phenyllactic acid; EI-B; MS; 2 TMS; RT: 632.60 s
DATE: 2016.01.19 (Created 2012.08.03, modified 2013.07.31)
AUTHORS: Miyagawa H, Akimoto S, Yamasaki K, GL Sciences Inc.
LICENSE: CC BY-SA
COPYRIGHT: GL Sciences Inc.
COMMENT: The chemical compound was chemically modified with N-methyl-N-trimethylsilyl-trifluoroacetamide(MSTFA) before GC-MS analysis. When it has two or more functional groups, this modification gave a mixture of the TMS derivatives having different number of TMS groups at different functional groups.

CH$NAME: D-3-Phenyllactic acid
CH$COMPOUND_CLASS: Natural Product
CH$FORMULA: C9H10O3
CH$EXACT_MASS: 166.06299
CH$SMILES: OC(=O)C(O)Cc(c1)cccc1
CH$IUPAC: InChI=1S/C9H10O3/c10-8(9(11)12)6-7-4-2-1-3-5-7/h1-5,8,10H,6H2,(H,11,12)/t8-/m1/s1
CH$LINK: CAS 103-82-2
CH$LINK: INCHIKEY VOXXWSYKYCBWHO-MRVPVSSYSA-N
CH$LINK: COMPTOX DTXSID70904708

AC$INSTRUMENT: GCMS-2010 Plus, Shimadzu
AC$INSTRUMENT_TYPE: EI-B
AC$MASS_SPECTROMETRY: MS_TYPE MS
AC$MASS_SPECTROMETRY: ION_MODE POSITIVE
AC$MASS_SPECTROMETRY: GAS_PRESSURE 75 kPa
AC$MASS_SPECTROMETRY: ION_SOURCE_TEMPERATURE 200 C
AC$MASS_SPECTROMETRY: SCAN_RANGE_M/Z 85-500
AC$CHROMATOGRAPHY: COLUMN_NAME InertCap 5MS/NP 0.25 mmI.D. x 30 m, df=0.25 um
AC$CHROMATOGRAPHY: INJECTION_TEMPERATURE 230 C
AC$CHROMATOGRAPHY: OVEN_TEMPERATURE 80 C(2 min)-15 C/min - 330C
AC$CHROMATOGRAPHY: RETENTION_INDEX 1599
AC$CHROMATOGRAPHY: RETENTION_TIME 632.60
AC$CHROMATOGRAPHY: TRANSFARLINE_TEMPERATURE 250 C

MS$FOCUSED_ION: DERIVATIVE_TYPE 2 TMS
MS$DATA_PROCESSING: WHOLE GCMSsolution

PK$SPLASH: splash10-0007-0920000000-7efa1766fa6121c5f695
PK$NUM_PEAK: 365
PK$PEAK: m/z int. rel.int.
  86.000000 542.000000 1
  87.000000 3716.000000 4
  88.050000 897.000000 1
  89.050000 6228.000000 6
  90.150000 2690.000000 3
  91.050000 64524.000000 63
  92.050000 6038.000000 6
  93.100000 1022.000000 1
  94.100000 108.000000 1
  95.100000 817.000000 1
  96.000000 287.000000 1
  97.050000 2136.000000 2
  98.000000 433.000000 1
  99.050000 1593.000000 2
  100.000000 417.000000 1
  101.000000 9233.000000 9
  102.050000 7508.000000 7
  103.050000 37980.000000 37
  104.050000 34355.000000 34
  105.050000 12280.000000 12
  106.050000 1408.000000 1
  107.050000 1690.000000 2
  108.000000 249.000000 1
  109.000000 250.000000 1
  110.000000 298.000000 1
  111.000000 503.000000 1
  112.000000 255.000000 1
  113.100000 1522.000000 1
  114.100000 186.000000 1
  115.050000 9130.000000 9
  116.100000 6338.000000 6
  117.050000 15968.000000 16
  118.100000 5090.000000 5
  119.100000 13831.000000 14
  120.050000 2882.000000 3
  121.050000 11796.000000 12
  122.050000 1655.000000 2
  123.100000 550.000000 1
  124.100000 164.000000 1
  125.100000 300.000000 1
  126.100000 4031.000000 4
  127.050000 1125.000000 1
  128.100000 846.000000 1
  129.100000 2922.000000 3
  130.150000 1169.000000 1
  131.100000 75180.000000 74
  132.100000 9756.000000 10
  133.050000 76043.000000 74
  134.100000 10590.000000 10
  135.100000 22030.000000 22
  136.100000 3054.000000 3
  137.150000 1511.000000 1
  138.100000 159.000000 1
  139.100000 177.000000 1
  140.150000 2894.000000 3
  141.200000 380.000000 1
  142.100000 1145.000000 1
  143.100000 1302.000000 1
  144.100000 470.000000 1
  145.100000 5966.000000 6
  146.150000 3798.000000 4
  147.150000 718312.000000 703
  148.100000 115378.000000 113
  149.100000 58697.000000 57
  150.150000 6596.000000 6
  151.100000 1604.000000 2
  152.100000 162.000000 1
  153.100000 130.000000 1
  154.100000 65.000000 1
  155.100000 169.000000 1
  156.100000 662.000000 1
  157.100000 302.000000 1
  158.100000 98.000000 1
  159.050000 3357.000000 3
  160.150000 888.000000 1
  161.100000 23871.000000 23
  162.100000 3870.000000 4
  163.100000 16041.000000 16
  164.150000 2693.000000 3
  165.100000 1166.000000 1
  166.100000 268.000000 1
  167.100000 118.000000 1
  168.100000 50.000000 1
  169.100000 174.000000 1
  170.100000 42.000000 1
  171.100000 94.000000 1
  172.100000 231.000000 1
  173.100000 441.000000 1
  174.100000 183.000000 1
  175.100000 7324.000000 7
  176.100000 5786.000000 6
  177.100000 15164.000000 15
  178.100000 5790.000000 6
  179.100000 2217.000000 2
  180.100000 390.000000 1
  181.100000 177.000000 1
  183.100000 105.000000 1
  184.100000 164.000000 1
  185.100000 122.000000 1
  186.100000 447.000000 1
  187.100000 127.000000 1
  188.100000 159.000000 1
  189.100000 494.000000 1
  190.100000 26010.000000 25
  191.100000 20761.000000 20
  192.150000 30487.000000 30
  193.100000 1021297.000000 999
  194.050000 166402.000000 163
  195.050000 45898.000000 45
  196.100000 5119.000000 5
  197.100000 524.000000 1
  198.100000 122.000000 1
  199.100000 50.000000 1
  200.100000 27.000000 1
  201.100000 156.000000 1
  202.100000 33.000000 1
  203.100000 494.000000 1
  204.150000 2394.000000 2
  205.050000 57138.000000 56
  206.050000 10707.000000 10
  207.050000 3947.000000 4
  208.000000 750.000000 1
  209.000000 615.000000 1
  210.000000 174.000000 1
  211.000000 143.000000 1
  212.000000 81.000000 1
  213.000000 78.000000 1
  214.000000 98.000000 1
  215.000000 82.000000 1
  216.000000 174.000000 1
  217.000000 748.000000 1
  218.150000 1095.000000 1
  219.050000 84048.000000 82
  220.050000 248390.000000 243
  221.050000 48185.000000 47
  222.050000 12606.000000 12
  223.000000 1482.000000 1
  224.000000 279.000000 1
  225.000000 63.000000 1
  228.000000 36.000000 1
  229.000000 42.000000 1
  230.000000 106.000000 1
  231.000000 98.000000 1
  232.000000 38.000000 1
  233.000000 266.000000 1
  234.000000 150.000000 1
  235.050000 6067.000000 6
  236.000000 1401.000000 1
  237.000000 655.000000 1
  238.000000 127.000000 1
  240.000000 10.000000 1
  241.000000 46.000000 1
  242.000000 78.000000 1
  243.000000 145.000000 1
  244.000000 68.000000 1
  245.000000 14.000000 1
  246.000000 34.000000 1
  247.000000 185.000000 1
  249.000000 242.000000 1
  250.100000 122.000000 1
  251.050000 5474.000000 5
  252.050000 1228.000000 1
  253.050000 1627.000000 2
  254.100000 476.000000 1
  255.100000 292.000000 1
  256.100000 137.000000 1
  258.100000 121.000000 1
  259.100000 135.000000 1
  260.100000 30.000000 1
  261.100000 97.000000 1
  262.100000 33.000000 1
  263.100000 146.000000 1
  264.100000 290.000000 1
  265.100000 201.000000 1
  266.100000 526.000000 1
  267.150000 137396.000000 134
  268.100000 32020.000000 31
  269.100000 12561.000000 12
  270.100000 1729.000000 2
  271.100000 574.000000 1
  272.100000 76.000000 1
  273.100000 22.000000 1
  274.100000 47.000000 1
  276.100000 73.000000 1
  277.100000 137.000000 1
  278.100000 50.000000 1
  279.050000 1792.000000 2
  280.000000 401.000000 1
  281.000000 329.000000 1
  282.000000 239.000000 1
  283.000000 70.000000 1
  284.000000 8.000000 1
  285.000000 74.000000 1
  286.000000 34.000000 1
  287.000000 29.000000 1
  288.000000 111.000000 1
  289.000000 46.000000 1
  291.000000 8.000000 1
  292.000000 161.000000 1
  293.000000 482.000000 1
  294.100000 519.000000 1
  295.100000 74638.000000 73
  296.100000 18479.000000 18
  297.100000 7494.000000 7
  298.050000 1134.000000 1
  299.100000 113.000000 1
  300.100000 33.000000 1
  302.100000 66.000000 1
  303.100000 27.000000 1
  307.100000 114.000000 1
  308.100000 68.000000 1
  309.100000 172.000000 1
  310.100000 154.000000 1
  311.100000 79.000000 1
  312.100000 47.000000 1
  314.100000 73.000000 1
  316.100000 27.000000 1
  318.100000 78.000000 1
  320.100000 124.000000 1
  322.100000 46.000000 1
  323.100000 105.000000 1
  324.100000 49.000000 1
  325.100000 19.000000 1
  326.100000 81.000000 1
  327.100000 225.000000 1
  328.100000 50.000000 1
  330.100000 19.000000 1
  331.100000 30.000000 1
  332.100000 97.000000 1
  333.100000 60.000000 1
  334.100000 21.000000 1
  335.100000 94.000000 1
  336.100000 10.000000 1
  337.100000 103.000000 1
  338.100000 50.000000 1
  339.100000 95.000000 1
  340.100000 58.000000 1
  341.100000 16.000000 1
  343.100000 124.000000 1
  344.100000 66.000000 1
  345.100000 73.000000 1
  346.100000 26.000000 1
  348.100000 105.000000 1
  349.100000 54.000000 1
  350.100000 8.000000 1
  351.100000 50.000000 1
  352.100000 108.000000 1
  353.100000 19.000000 1
  354.100000 2.000000 1
  355.100000 18.000000 1
  357.100000 29.000000 1
  358.100000 42.000000 1
  359.100000 82.000000 1
  360.100000 60.000000 1
  361.100000 46.000000 1
  363.100000 57.000000 1
  364.100000 14.000000 1
  365.100000 57.000000 1
  366.100000 94.000000 1
  367.100000 74.000000 1
  368.100000 10.000000 1
  369.100000 92.000000 1
  370.100000 86.000000 1
  371.100000 19.000000 1
  372.100000 49.000000 1
  373.100000 114.000000 1
  374.100000 62.000000 1
  375.100000 62.000000 1
  376.100000 158.000000 1
  377.100000 11.000000 1
  378.100000 79.000000 1
  379.100000 68.000000 1
  381.100000 26.000000 1
  382.100000 161.000000 1
  383.100000 679.000000 1
  384.100000 254.000000 1
  385.100000 97.000000 1
  386.100000 145.000000 1
  387.100000 138.000000 1
  388.100000 78.000000 1
  389.100000 33.000000 1
  391.100000 55.000000 1
  392.100000 46.000000 1
  393.100000 47.000000 1
  394.100000 33.000000 1
  398.100000 54.000000 1
  401.100000 114.000000 1
  402.100000 52.000000 1
  403.100000 41.000000 1
  404.100000 98.000000 1
  406.100000 129.000000 1
  407.100000 70.000000 1
  408.100000 113.000000 1
  409.100000 42.000000 1
  411.100000 42.000000 1
  413.100000 76.000000 1
  415.100000 11.000000 1
  416.100000 50.000000 1
  417.100000 50.000000 1
  418.100000 87.000000 1
  419.100000 126.000000 1
  420.100000 60.000000 1
  421.100000 47.000000 1
  423.100000 41.000000 1
  424.100000 42.000000 1
  425.100000 29.000000 1
  426.100000 46.000000 1
  427.100000 170.000000 1
  428.100000 18.000000 1
  429.100000 60.000000 1
  431.100000 111.000000 1
  432.100000 119.000000 1
  433.100000 30.000000 1
  434.100000 6.000000 1
  435.100000 13.000000 1
  436.100000 26.000000 1
  437.100000 21.000000 1
  438.100000 87.000000 1
  440.100000 68.000000 1
  441.100000 18.000000 1
  442.100000 58.000000 1
  443.100000 68.000000 1
  444.100000 8.000000 1
  446.100000 138.000000 1
  447.100000 97.000000 1
  448.100000 55.000000 1
  449.100000 79.000000 1
  450.100000 49.000000 1
  451.100000 46.000000 1
  454.100000 105.000000 1
  456.100000 55.000000 1
  457.100000 10.000000 1
  458.100000 225.000000 1
  459.100000 16.000000 1
  460.100000 30.000000 1
  461.100000 151.000000 1
  462.100000 42.000000 1
  463.100000 13.000000 1
  464.100000 62.000000 1
  466.100000 71.000000 1
  467.100000 38.000000 1
  468.100000 14.000000 1
  470.100000 18.000000 1
  471.100000 60.000000 1
  472.100000 73.000000 1
  475.100000 26.000000 1
  476.100000 68.000000 1
  477.100000 2.000000 1
  478.100000 36.000000 1
  480.100000 74.000000 1
  481.100000 33.000000 1
  482.100000 21.000000 1
  483.100000 30.000000 1
  484.100000 86.000000 1
  485.100000 94.000000 1
  486.100000 16.000000 1
  487.100000 106.000000 1
  488.100000 14.000000 1
  491.100000 60.000000 1
  493.100000 116.000000 1
  494.100000 74.000000 1
  496.100000 78.000000 1
  497.100000 116.000000 1
  498.100000 38.000000 1
  499.100000 102.000000 1