ACCESSION: MSBNK-GL_Sciences_Inc-GLS00085
RECORD_TITLE: D-(+)-Fucose; EI-B; MS; n TMS; RT: 709.19 s
DATE: 2016.01.19 (Created 2012.08.03, modified 2013.07.31)
AUTHORS: Miyagawa H, Akimoto S, Yamasaki K, GL Sciences Inc.
LICENSE: CC BY-SA
COPYRIGHT: GL Sciences Inc.
COMMENT: The chemical compound was chemically modified with N-methyl-N-trimethylsilyl-trifluoroacetamide(MSTFA) before GC-MS analysis. When it has two or more functional groups, this modification gave a mixture of the TMS derivatives having different number of TMS groups at different functional groups.

CH$NAME: D-(+)-Fucose
CH$COMPOUND_CLASS: Natural Product
CH$FORMULA: C6H12O5
CH$EXACT_MASS: 164.06847
CH$SMILES: CC(O1)C(O)C(O)C(O)C(O)1
CH$IUPAC: InChI=1S/C6H12O5/c1-2-3(7)4(8)5(9)6(10)11-2/h2-10H,1H3/t2-,3+,4+,5-,6-/m1/s1
CH$LINK: CAS 2438-80-4
CH$LINK: INCHIKEY SHZGCJCMOBCMKK-FPRJBGLDSA-N

AC$INSTRUMENT: GCMS-2010 Plus, Shimadzu
AC$INSTRUMENT_TYPE: EI-B
AC$MASS_SPECTROMETRY: MS_TYPE MS
AC$MASS_SPECTROMETRY: ION_MODE POSITIVE
AC$MASS_SPECTROMETRY: GAS_PRESSURE 75 kPa
AC$MASS_SPECTROMETRY: ION_SOURCE_TEMPERATURE 200 C
AC$MASS_SPECTROMETRY: SCAN_RANGE_M/Z 85-500
AC$CHROMATOGRAPHY: COLUMN_NAME InertCap 5MS/NP 0.25 mmI.D. x 30 m, df=0.25 um
AC$CHROMATOGRAPHY: INJECTION_TEMPERATURE 230 C
AC$CHROMATOGRAPHY: OVEN_TEMPERATURE 80 C(2 min)-15 C/min - 330C
AC$CHROMATOGRAPHY: RETENTION_INDEX 1756
AC$CHROMATOGRAPHY: RETENTION_TIME 709.19
AC$CHROMATOGRAPHY: TRANSFARLINE_TEMPERATURE 250 C

MS$FOCUSED_ION: DERIVATIVE_TYPE n TMS
MS$DATA_PROCESSING: WHOLE GCMSsolution

PK$SPLASH: splash10-014i-0920000000-5b075e8c757a442fb54b
PK$NUM_PEAK: 393
PK$PEAK: m/z int. rel.int.
  86.050000 5745.000000 3
  87.000000 6492.000000 3
  88.050000 2070.000000 1
  89.050000 41737.000000 19
  90.050000 3451.000000 2
  91.050000 2268.000000 1
  92.000000 321.000000 1
  93.000000 404.000000 1
  94.000000 289.000000 1
  95.000000 372.000000 1
  96.000000 327.000000 1
  97.000000 868.000000 1
  98.000000 1481.000000 1
  99.050000 5121.000000 2
  100.050000 51055.000000 23
  101.050000 28557.000000 13
  102.050000 18877.000000 8
  103.050000 33071.000000 15
  104.050000 3743.000000 2
  105.050000 31843.000000 14
  106.100000 2956.000000 1
  107.050000 1379.000000 1
  108.050000 2208.000000 1
  109.000000 607.000000 1
  110.000000 591.000000 1
  111.050000 1551.000000 1
  112.050000 3450.000000 2
  113.050000 3042.000000 1
  114.050000 15881.000000 7
  115.050000 24555.000000 11
  116.150000 21178.000000 10
  117.050000 2222346.000000 999
  118.100000 228175.000000 103
  119.050000 91306.000000 41
  120.050000 5046.000000 2
  121.100000 607.000000 1
  122.100000 364.000000 1
  123.100000 90.000000 1
  124.100000 324.000000 1
  125.100000 670.000000 1
  126.050000 2179.000000 1
  127.050000 5879.000000 3
  128.150000 5324.000000 2
  129.050000 149637.000000 67
  130.050000 39400.000000 18
  131.050000 88485.000000 40
  132.050000 11863.000000 5
  133.050000 68005.000000 31
  134.050000 9251.000000 4
  135.000000 5734.000000 3
  136.000000 530.000000 1
  137.000000 178.000000 1
  138.000000 116.000000 1
  139.000000 239.000000 1
  140.100000 2002.000000 1
  141.050000 5338.000000 2
  142.050000 9187.000000 4
  143.050000 23890.000000 11
  144.050000 4372.000000 2
  145.050000 7956.000000 4
  146.150000 3769.000000 2
  147.050000 228303.000000 103
  148.050000 35695.000000 16
  149.050000 26620.000000 12
  150.050000 2875.000000 1
  151.050000 1607.000000 1
  152.000000 770.000000 1
  153.000000 441.000000 1
  154.100000 1479.000000 1
  155.100000 2887.000000 1
  156.100000 3206.000000 1
  157.050000 3880.000000 2
  158.050000 5933.000000 3
  159.150000 5052.000000 2
  160.100000 267449.000000 120
  161.100000 114550.000000 51
  162.100000 21817.000000 10
  163.050000 20802.000000 9
  164.100000 3383.000000 2
  165.050000 2106.000000 1
  166.100000 727.000000 1
  167.100000 279.000000 1
  168.100000 734.000000 1
  169.100000 732.000000 1
  170.050000 2741.000000 1
  171.050000 6490.000000 3
  172.050000 11812.000000 5
  173.050000 7363.000000 3
  174.050000 4759.000000 2
  175.000000 3852.000000 2
  176.000000 684.000000 1
  177.050000 5040.000000 2
  178.000000 985.000000 1
  179.000000 590.000000 1
  180.100000 1425.000000 1
  181.050000 1957.000000 1
  182.000000 4404.000000 2
  183.000000 1129.000000 1
  184.000000 610.000000 1
  185.000000 700.000000 1
  186.050000 5439.000000 2
  187.000000 1868.000000 1
  188.050000 3646.000000 2
  189.000000 28830.000000 13
  190.000000 7993.000000 4
  191.000000 52230.000000 23
  192.000000 9302.000000 4
  193.000000 4258.000000 2
  194.000000 724.000000 1
  195.000000 207.000000 1
  196.000000 314.000000 1
  197.000000 375.000000 1
  198.050000 1415.000000 1
  199.000000 452.000000 1
  200.050000 2386.000000 1
  201.050000 63715.000000 29
  202.000000 13737.000000 6
  203.000000 52980.000000 24
  204.050000 52395.000000 24
  205.000000 16980.000000 8
  206.050000 5363.000000 2
  207.000000 3758.000000 2
  208.000000 658.000000 1
  209.000000 482.000000 1
  210.000000 92.000000 1
  211.000000 31.000000 1
  212.000000 3975.000000 2
  213.000000 839.000000 1
  214.050000 2819.000000 1
  215.000000 4479.000000 2
  216.050000 15459.000000 7
  217.050000 36338.000000 16
  218.100000 13679.000000 6
  219.050000 113484.000000 51
  220.050000 24164.000000 11
  221.050000 18232.000000 8
  222.000000 3326.000000 1
  223.000000 1343.000000 1
  224.000000 225.000000 1
  225.000000 31.000000 1
  226.000000 415.000000 1
  227.050000 757.000000 1
  228.000000 8954.000000 4
  229.050000 4158.000000 2
  230.100000 7498.000000 3
  231.050000 61372.000000 28
  232.050000 19361.000000 9
  233.050000 77073.000000 35
  234.050000 25998.000000 12
  235.000000 9361.000000 4
  236.000000 2137.000000 1
  237.000000 375.000000 1
  238.000000 186.000000 1
  239.000000 241.000000 1
  240.050000 1177.000000 1
  241.000000 300.000000 1
  242.000000 1316.000000 1
  243.050000 2897.000000 1
  244.000000 14468.000000 7
  245.000000 7825.000000 4
  246.050000 7902.000000 4
  247.000000 2082.000000 1
  248.000000 1561.000000 1
  249.000000 308.000000 1
  250.000000 166.000000 1
  251.000000 78.000000 1
  252.000000 65.000000 1
  253.000000 100.000000 1
  254.000000 1796.000000 1
  255.150000 1707.000000 1
  256.050000 7333.000000 3
  257.000000 1951.000000 1
  258.050000 1261.000000 1
  259.100000 708.000000 1
  260.050000 2524.000000 1
  261.150000 1586.000000 1
  262.050000 12202.000000 5
  263.000000 2967.000000 1
  264.100000 1542.000000 1
  265.000000 1540.000000 1
  266.000000 431.000000 1
  267.000000 132.000000 1
  268.000000 177.000000 1
  269.100000 148.000000 1
  270.100000 6623.000000 3
  271.050000 3647.000000 2
  272.000000 1434.000000 1
  273.100000 530.000000 1
  274.050000 14912.000000 7
  275.050000 3586.000000 2
  276.150000 4572.000000 2
  277.050000 285511.000000 128
  278.050000 83761.000000 38
  279.050000 40242.000000 18
  280.050000 7046.000000 3
  281.100000 1834.000000 1
  282.100000 322.000000 1
  283.100000 68.000000 1
  284.100000 76.000000 1
  285.100000 44.000000 1
  286.100000 1426.000000 1
  287.100000 257.000000 1
  288.100000 902.000000 1
  289.100000 473.000000 1
  290.100000 1468.000000 1
  291.050000 10097.000000 5
  292.100000 3242.000000 1
  293.050000 14319.000000 6
  294.000000 3583.000000 2
  295.100000 1959.000000 1
  296.100000 342.000000 1
  297.100000 95.000000 1
  298.100000 73.000000 1
  299.100000 54.000000 1
  300.100000 287.000000 1
  301.100000 278.000000 1
  302.100000 4914.000000 2
  303.050000 1897.000000 1
  304.100000 2170.000000 1
  305.100000 12708.000000 6
  306.050000 5588.000000 3
  307.050000 2639.000000 1
  308.100000 758.000000 1
  309.100000 207.000000 1
  310.100000 41.000000 1
  311.100000 113.000000 1
  312.100000 50.000000 1
  313.100000 92.000000 1
  314.100000 222.000000 1
  315.100000 561.000000 1
  316.100000 770.000000 1
  317.100000 799.000000 1
  318.100000 5606.000000 3
  319.100000 3330.000000 1
  320.150000 3671.000000 2
  321.100000 100390.000000 45
  322.100000 33241.000000 15
  323.100000 15639.000000 7
  324.100000 3089.000000 1
  325.100000 839.000000 1
  326.100000 191.000000 1
  327.100000 113.000000 1
  328.100000 414.000000 1
  329.100000 372.000000 1
  330.100000 3782.000000 2
  331.050000 1051.000000 1
  332.050000 1926.000000 1
  333.100000 1727.000000 1
  334.100000 746.000000 1
  335.100000 340.000000 1
  336.100000 802.000000 1
  337.100000 257.000000 1
  338.100000 73.000000 1
  339.100000 68.000000 1
  341.100000 73.000000 1
  342.100000 30.000000 1
  343.100000 162.000000 1
  344.050000 4093.000000 2
  345.050000 4075.000000 2
  346.050000 2059.000000 1
  347.000000 796.000000 1
  348.000000 409.000000 1
  349.000000 281.000000 1
  350.000000 305.000000 1
  351.000000 132.000000 1
  353.000000 31.000000 1
  355.000000 41.000000 1
  356.000000 24.000000 1
  357.000000 58.000000 1
  358.000000 57.000000 1
  359.000000 39.000000 1
  360.000000 1121.000000 1
  361.000000 297.000000 1
  362.000000 367.000000 1
  363.100000 385.000000 1
  364.150000 11350.000000 5
  365.100000 3498.000000 2
  366.150000 1562.000000 1
  367.100000 404.000000 1
  368.100000 110.000000 1
  370.100000 5.000000 1
  371.100000 13.000000 1
  372.100000 100.000000 1
  373.100000 102.000000 1
  374.100000 103.000000 1
  375.100000 68.000000 1
  376.050000 4315.000000 2
  377.000000 1577.000000 1
  378.000000 671.000000 1
  379.000000 471.000000 1
  380.000000 52.000000 1
  381.000000 31.000000 1
  382.000000 18.000000 1
  383.000000 47.000000 1
  385.000000 60.000000 1
  386.000000 11.000000 1
  387.000000 18.000000 1
  388.000000 70.000000 1
  389.000000 36.000000 1
  390.000000 695.000000 1
  391.000000 449.000000 1
  392.150000 3009.000000 1
  393.050000 1151.000000 1
  394.000000 601.000000 1
  395.000000 30.000000 1
  396.000000 34.000000 1
  397.000000 2.000000 1
  398.000000 73.000000 1
  399.000000 52.000000 1
  400.000000 30.000000 1
  401.000000 21.000000 1
  403.000000 2.000000 1
  404.000000 63.000000 1
  405.000000 36.000000 1
  406.000000 228.000000 1
  407.000000 233.000000 1
  408.000000 138.000000 1
  409.000000 27.000000 1
  411.000000 159.000000 1
  412.000000 114.000000 1
  413.000000 14.000000 1
  414.000000 54.000000 1
  417.000000 11.000000 1
  418.000000 126.000000 1
  419.000000 137.000000 1
  420.000000 180.000000 1
  421.000000 81.000000 1
  422.000000 54.000000 1
  423.000000 46.000000 1
  425.000000 27.000000 1
  426.000000 154.000000 1
  427.000000 42.000000 1
  428.000000 95.000000 1
  429.000000 60.000000 1
  430.000000 62.000000 1
  431.000000 2.000000 1
  432.000000 87.000000 1
  433.000000 46.000000 1
  434.000000 694.000000 1
  435.200000 1758.000000 1
  436.200000 830.000000 1
  437.200000 278.000000 1
  438.200000 202.000000 1
  439.200000 57.000000 1
  440.200000 63.000000 1
  441.200000 16.000000 1
  442.200000 89.000000 1
  443.200000 73.000000 1
  444.200000 38.000000 1
  445.200000 14.000000 1
  447.200000 81.000000 1
  449.200000 106.000000 1
  450.150000 1018.000000 1
  451.100000 538.000000 1
  452.100000 268.000000 1
  453.100000 121.000000 1
  454.100000 94.000000 1
  455.100000 113.000000 1
  457.100000 87.000000 1
  458.100000 18.000000 1
  460.100000 10.000000 1
  461.100000 18.000000 1
  463.100000 78.000000 1
  464.100000 34.000000 1
  465.100000 34.000000 1
  466.100000 2996.000000 1
  467.100000 1310.000000 1
  468.100000 788.000000 1
  469.100000 186.000000 1
  470.100000 33.000000 1
  471.100000 87.000000 1
  473.100000 14.000000 1
  474.100000 6.000000 1
  475.100000 36.000000 1
  476.100000 57.000000 1
  477.100000 82.000000 1
  479.100000 158.000000 1
  480.100000 19.000000 1
  481.100000 642.000000 1
  482.100000 700.000000 1
  483.100000 143.000000 1
  484.100000 127.000000 1
  485.100000 82.000000 1
  486.100000 54.000000 1
  487.100000 65.000000 1
  488.100000 39.000000 1
  489.100000 31.000000 1
  491.100000 22.000000 1
  492.100000 8.000000 1
  495.100000 2.000000 1
  496.100000 10.000000 1
  498.100000 5.000000 1
  499.100000 24.000000 1