ACCESSION: MSBNK-GL_Sciences_Inc-GLS00093
RECORD_TITLE: 4-Hydroxyphenylpyruvic acid; EI-B; MS; n TMS; RT: 781.80 s
DATE: 2016.01.19 (Created 2012.08.03, modified 2013.07.31)
AUTHORS: Miyagawa H, Akimoto S, Yamasaki K, GL Sciences Inc.
LICENSE: CC BY-SA
COPYRIGHT: GL Sciences Inc.
COMMENT: The chemical compound was chemically modified with N-methyl-N-trimethylsilyl-trifluoroacetamide(MSTFA) before GC-MS analysis. When it has two or more functional groups, this modification gave a mixture of the TMS derivatives having different number of TMS groups at different functional groups.

CH$NAME: 4-Hydroxyphenylpyruvic acid
CH$NAME: 4-Hydroxyphenylpyruvate
CH$COMPOUND_CLASS: Natural Product
CH$FORMULA: C9H8O4
CH$EXACT_MASS: 180.04226
CH$SMILES: OC(=O)C(=O)Cc(c1)ccc(O)c1
CH$IUPAC: InChI=1S/C9H8O4/c10-7-3-1-6(2-4-7)5-8(11)9(12)13/h1-4,10H,5H2,(H,12,13)
CH$LINK: CAS 156-39-8
CH$LINK: CHEBI 15999
CH$LINK: KEGG C01179
CH$LINK: PUBCHEM 4406
CH$LINK: INCHIKEY KKADPXVIOXHVKN-UHFFFAOYSA-N
CH$LINK: COMPTOX DTXSID80166017

AC$INSTRUMENT: GCMS-2010 Plus, Shimadzu
AC$INSTRUMENT_TYPE: EI-B
AC$MASS_SPECTROMETRY: MS_TYPE MS
AC$MASS_SPECTROMETRY: ION_MODE POSITIVE
AC$MASS_SPECTROMETRY: GAS_PRESSURE 75 kPa
AC$MASS_SPECTROMETRY: ION_SOURCE_TEMPERATURE 200 C
AC$MASS_SPECTROMETRY: SCAN_RANGE_M/Z 85-500
AC$CHROMATOGRAPHY: COLUMN_NAME InertCap 5MS/NP 0.25 mmI.D. x 30 m, df=0.25 um
AC$CHROMATOGRAPHY: INJECTION_TEMPERATURE 230 C
AC$CHROMATOGRAPHY: OVEN_TEMPERATURE 80 C(2 min)-15 C/min - 330C
AC$CHROMATOGRAPHY: RETENTION_INDEX 1918
AC$CHROMATOGRAPHY: RETENTION_TIME 781.80
AC$CHROMATOGRAPHY: TRANSFARLINE_TEMPERATURE 250 C

MS$FOCUSED_ION: DERIVATIVE_TYPE n TMS
MS$DATA_PROCESSING: WHOLE GCMSsolution

PK$SPLASH: splash10-002f-1951000000-ecd071a64b26ca77684c
PK$NUM_PEAK: 379
PK$PEAK: m/z int. rel.int.
  86.100000 521.000000 7
  87.100000 377.000000 5
  88.000000 257.000000 3
  89.050000 13940.000000 176
  90.050000 2369.000000 30
  91.050000 2843.000000 36
  92.000000 247.000000 3
  93.000000 410.000000 5
  94.000000 284.000000 4
  95.000000 966.000000 12
  96.000000 274.000000 3
  97.000000 278.000000 4
  98.000000 314.000000 4
  99.000000 354.000000 4
  100.000000 398.000000 5
  101.000000 266.000000 3
  102.000000 319.000000 4
  103.100000 1417.000000 18
  104.000000 1022.000000 13
  105.100000 1522.000000 19
  106.100000 337.000000 4
  107.050000 1034.000000 13
  108.100000 188.000000 2
  109.100000 282.000000 4
  110.100000 302.000000 4
  111.100000 386.000000 5
  112.100000 172.000000 2
  113.100000 218.000000 3
  114.100000 154.000000 2
  115.100000 692.000000 9
  116.050000 7422.000000 94
  117.050000 1920.000000 24
  118.100000 414.000000 5
  119.100000 799.000000 10
  120.100000 250.000000 3
  121.100000 855.000000 11
  122.100000 295.000000 4
  123.100000 335.000000 4
  124.100000 273.000000 3
  125.100000 166.000000 2
  126.100000 92.000000 1
  127.100000 198.000000 2
  128.100000 271.000000 3
  129.100000 652.000000 8
  130.050000 1082.000000 14
  131.000000 1782.000000 22
  132.000000 596.000000 8
  133.000000 1372.000000 17
  134.000000 730.000000 9
  135.050000 4020.000000 51
  136.000000 455.000000 6
  137.000000 390.000000 5
  138.000000 121.000000 2
  139.000000 103.000000 1
  140.000000 6.000000 1
  141.000000 228.000000 3
  142.000000 102.000000 1
  143.000000 449.000000 6
  144.000000 326.000000 4
  145.000000 447.000000 6
  146.000000 468.000000 6
  147.000000 3607.000000 46
  148.100000 748.000000 9
  149.050000 4040.000000 51
  150.050000 1417.000000 18
  151.000000 686.000000 9
  152.000000 127.000000 2
  153.000000 121.000000 2
  154.000000 81.000000 1
  155.000000 135.000000 2
  156.000000 222.000000 3
  157.000000 201.000000 3
  158.000000 401.000000 5
  159.000000 354.000000 4
  160.100000 3319.000000 42
  161.600000 7751.000000 98
  163.000000 4082.000000 52
  164.000000 1471.000000 19
  165.000000 612.000000 8
  166.000000 142.000000 2
  167.000000 132.000000 2
  168.000000 81.000000 1
  169.000000 265.000000 3
  170.000000 257.000000 3
  171.000000 73.000000 1
  172.000000 455.000000 6
  173.000000 226.000000 3
  174.050000 1087.000000 14
  175.100000 425.000000 5
  176.000000 428.000000 5
  177.000000 3644.000000 46
  178.000000 602.000000 8
  179.050000 12333.000000 156
  180.100000 1858.000000 23
  181.100000 714.000000 9
  182.100000 143.000000 2
  183.100000 170.000000 2
  184.100000 55.000000 1
  185.100000 63.000000 1
  186.100000 212.000000 3
  187.100000 150.000000 2
  188.000000 918.000000 12
  189.050000 1773.000000 22
  190.050000 79151.000000 999
  191.000000 12922.000000 163
  192.000000 3092.000000 39
  193.000000 1049.000000 13
  194.000000 302.000000 4
  195.000000 182.000000 2
  196.000000 127.000000 2
  197.000000 78.000000 1
  199.000000 129.000000 2
  200.000000 13.000000 1
  201.000000 177.000000 2
  202.000000 711.000000 9
  203.050000 845.000000 11
  204.000000 9241.000000 117
  205.000000 4230.000000 53
  206.000000 1858.000000 23
  207.000000 694.000000 9
  208.000000 302.000000 4
  209.000000 350.000000 4
  210.000000 242.000000 3
  211.000000 119.000000 2
  212.000000 63.000000 1
  213.000000 78.000000 1
  214.000000 6.000000 1
  215.000000 8.000000 1
  216.000000 310.000000 4
  217.000000 433.000000 5
  218.000000 825.000000 10
  219.000000 857.000000 11
  220.000000 222.000000 3
  221.000000 265.000000 3
  222.000000 22.000000 1
  223.050000 1027.000000 13
  224.000000 260.000000 3
  225.000000 262.000000 3
  226.000000 54.000000 1
  228.000000 3.000000 1
  229.000000 105.000000 1
  230.000000 58.000000 1
  231.000000 657.000000 8
  232.000000 4238.000000 53
  233.000000 698.000000 9
  234.000000 497.000000 6
  235.000000 353.000000 4
  236.000000 482.000000 6
  237.000000 132.000000 2
  238.000000 86.000000 1
  239.000000 153.000000 2
  240.000000 19.000000 1
  241.000000 122.000000 2
  242.000000 105.000000 1
  243.000000 111.000000 1
  244.000000 134.000000 2
  245.000000 76.000000 1
  246.000000 327.000000 4
  247.000000 239.000000 3
  248.000000 284.000000 4
  249.000000 201.000000 3
  250.000000 126.000000 2
  251.000000 316.000000 4
  252.000000 87.000000 1
  253.000000 199.000000 3
  254.000000 87.000000 1
  255.000000 84.000000 1
  256.000000 60.000000 1
  257.000000 138.000000 2
  258.000000 47.000000 1
  259.000000 110.000000 1
  260.000000 92.000000 1
  261.000000 202.000000 3
  262.050000 1291.000000 16
  263.100000 895.000000 11
  264.100000 1026.000000 13
  265.100000 703.000000 9
  266.100000 518.000000 7
  267.050000 1540.000000 19
  268.000000 404.000000 5
  269.000000 166.000000 2
  270.000000 134.000000 2
  271.000000 55.000000 1
  272.000000 111.000000 1
  273.000000 350.000000 4
  274.000000 217.000000 3
  275.000000 82.000000 1
  276.100000 225.000000 3
  277.100000 32914.000000 415
  278.050000 23560.000000 297
  279.050000 10039.000000 127
  280.050000 2994.000000 38
  281.100000 825.000000 10
  282.100000 348.000000 4
  283.100000 135.000000 2
  285.100000 239.000000 3
  286.100000 71.000000 1
  287.100000 150.000000 2
  288.100000 108.000000 1
  289.100000 84.000000 1
  290.100000 52.000000 1
  291.100000 52.000000 1
  292.100000 142.000000 2
  293.100000 132.000000 2
  294.100000 265.000000 3
  295.100000 265.000000 3
  296.100000 130.000000 2
  297.100000 159.000000 2
  298.100000 55.000000 1
  299.100000 222.000000 3
  300.100000 161.000000 2
  301.100000 124.000000 2
  302.100000 90.000000 1
  304.100000 39.000000 1
  305.100000 41.000000 1
  306.000000 55.000000 1
  307.050000 2288.000000 29
  308.000000 407.000000 5
  309.000000 119.000000 2
  310.000000 151.000000 2
  311.000000 57.000000 1
  312.000000 41.000000 1
  313.000000 65.000000 1
  314.000000 8.000000 1
  315.000000 47.000000 1
  316.000000 74.000000 1
  318.000000 34.000000 1
  319.000000 50.000000 1
  320.000000 36.000000 1
  321.000000 81.000000 1
  322.000000 849.000000 11
  323.000000 890.000000 11
  324.000000 273.000000 3
  325.000000 70.000000 1
  326.000000 98.000000 1
  327.000000 89.000000 1
  328.000000 36.000000 1
  329.000000 14.000000 1
  330.000000 62.000000 1
  331.000000 42.000000 1
  333.000000 62.000000 1
  334.000000 2.000000 1
  335.000000 74.000000 1
  336.000000 65.000000 1
  337.100000 153.000000 2
  338.050000 9910.000000 125
  339.100000 2924.000000 37
  340.000000 930.000000 12
  341.000000 273.000000 3
  343.000000 66.000000 1
  344.000000 62.000000 1
  345.000000 94.000000 1
  346.000000 42.000000 1
  349.000000 129.000000 2
  350.000000 24.000000 1
  351.000000 90.000000 1
  352.100000 161.000000 2
  353.100000 6265.000000 79
  354.150000 1541.000000 19
  355.100000 583.000000 7
  356.100000 263.000000 3
  357.100000 30.000000 1
  358.100000 86.000000 1
  359.100000 58.000000 1
  360.100000 97.000000 1
  361.100000 95.000000 1
  362.100000 47.000000 1
  363.100000 62.000000 1
  364.100000 74.000000 1
  365.100000 39.000000 1
  367.100000 84.000000 1
  368.100000 57.000000 1
  369.100000 26.000000 1
  370.100000 74.000000 1
  371.100000 106.000000 1
  372.100000 122.000000 2
  373.100000 19.000000 1
  374.100000 63.000000 1
  375.100000 103.000000 1
  376.100000 8.000000 1
  378.100000 24.000000 1
  380.100000 41.000000 1
  382.100000 18.000000 1
  383.100000 31.000000 1
  384.100000 66.000000 1
  385.100000 34.000000 1
  386.100000 68.000000 1
  387.100000 41.000000 1
  389.100000 27.000000 1
  390.100000 122.000000 2
  391.100000 29.000000 1
  392.100000 5.000000 1
  394.100000 5.000000 1
  395.100000 81.000000 1
  396.100000 54.000000 1
  397.100000 6.000000 1
  398.100000 14.000000 1
  399.100000 76.000000 1
  400.100000 86.000000 1
  401.100000 47.000000 1
  402.100000 30.000000 1
  403.100000 29.000000 1
  404.100000 22.000000 1
  405.100000 46.000000 1
  406.100000 153.000000 2
  407.100000 113.000000 1
  409.100000 52.000000 1
  410.100000 70.000000 1
  411.100000 63.000000 1
  412.100000 38.000000 1
  413.100000 90.000000 1
  414.100000 209.000000 3
  416.100000 38.000000 1
  417.100000 5.000000 1
  419.100000 98.000000 1
  420.100000 19.000000 1
  421.100000 132.000000 2
  422.100000 5.000000 1
  423.100000 84.000000 1
  424.100000 71.000000 1
  425.100000 34.000000 1
  426.100000 84.000000 1
  427.100000 47.000000 1
  428.100000 44.000000 1
  429.100000 130.000000 2
  430.100000 79.000000 1
  431.100000 54.000000 1
  432.100000 70.000000 1
  434.100000 50.000000 1
  435.100000 70.000000 1
  436.100000 14.000000 1
  437.100000 129.000000 2
  439.100000 30.000000 1
  440.100000 58.000000 1
  442.100000 71.000000 1
  443.100000 92.000000 1
  444.100000 94.000000 1
  445.100000 54.000000 1
  446.100000 71.000000 1
  447.100000 27.000000 1
  448.100000 84.000000 1
  449.100000 66.000000 1
  450.100000 132.000000 2
  452.100000 66.000000 1
  453.100000 68.000000 1
  454.100000 49.000000 1
  455.100000 129.000000 2
  456.100000 52.000000 1
  457.100000 129.000000 2
  459.100000 90.000000 1
  460.100000 71.000000 1
  461.100000 19.000000 1
  463.100000 95.000000 1
  464.100000 13.000000 1
  466.100000 94.000000 1
  467.100000 121.000000 2
  468.100000 39.000000 1
  469.100000 14.000000 1
  470.100000 26.000000 1
  471.100000 126.000000 2
  474.100000 52.000000 1
  475.100000 70.000000 1
  477.100000 8.000000 1
  479.100000 79.000000 1
  480.100000 50.000000 1
  481.100000 89.000000 1
  482.100000 49.000000 1
  484.100000 44.000000 1
  485.100000 68.000000 1
  486.100000 6.000000 1
  488.100000 50.000000 1
  490.100000 106.000000 1
  491.100000 74.000000 1
  492.100000 13.000000 1
  493.100000 10.000000 1
  494.100000 27.000000 1
  495.100000 16.000000 1
  496.100000 29.000000 1
  499.100000 34.000000 1