ACCESSION: MSBNK-GL_Sciences_Inc-GLS00102
RECORD_TITLE: Lanthionine; EI-B; MS; 4 TMS; RT: 865.81 s
DATE: 2016.01.19 (Created 2012.08.03, modified 2013.07.31)
AUTHORS: Miyagawa H, Akimoto S, Yamasaki K, GL Sciences Inc.
LICENSE: CC BY-SA
COPYRIGHT: GLS
COMMENT: The chemical compound was chemically modified with N-methyl-N-trimethylsilyl-trifluoroacetamide(MSTFA) before GC-MS analysis. When it has two or more functional groups, this modification gave a mixture of the TMS derivatives having different number of TMS groups at different functional groups.

CH$NAME: Lanthionine
CH$COMPOUND_CLASS: Natural Product
CH$FORMULA: C6H12N2O4S
CH$EXACT_MASS: 208.05178
CH$SMILES: OC(=O)C(N)CSCC(N)C(O)=O
CH$IUPAC: InChI=1S/C6H12N2O4S/c7-3(5(9)10)1-13-2-4(8)6(11)12/h3-4H,1-2,7-8H2,(H,9,10)(H,11,12)/t3-,4-/m0/s1
CH$LINK: CAS 922-55-4
CH$LINK: INCHIKEY DWPCPZJAHOETAG-IMJSIDKUSA-N

AC$INSTRUMENT: GCMS-2010 Plus, Shimadzu
AC$INSTRUMENT_TYPE: EI-B
AC$MASS_SPECTROMETRY: MS_TYPE MS
AC$MASS_SPECTROMETRY: ION_MODE POSITIVE
AC$MASS_SPECTROMETRY: GAS_PRESSURE 75 kPa
AC$MASS_SPECTROMETRY: ION_SOURCE_TEMPERATURE 200 C
AC$MASS_SPECTROMETRY: SCAN_RANGE_M/Z 85-500
AC$CHROMATOGRAPHY: COLUMN_NAME InertCap 5MS/NP 0.25 mmI.D. x 30 m, df=0.25 um
AC$CHROMATOGRAPHY: INJECTION_TEMPERATURE 230 C
AC$CHROMATOGRAPHY: OVEN_TEMPERATURE 80 C(2 min)-15 C/min - 330C
AC$CHROMATOGRAPHY: RETENTION_INDEX 2122
AC$CHROMATOGRAPHY: RETENTION_TIME 865.81
AC$CHROMATOGRAPHY: TRANSFARLINE_TEMPERATURE 250 C

MS$FOCUSED_ION: DERIVATIVE_TYPE 4 TMS
MS$DATA_PROCESSING: WHOLE GCMSsolution

PK$SPLASH: splash10-014i-0490000000-d334dfd9b7d76d44f9d9
PK$NUM_PEAK: 397
PK$PEAK: m/z int. rel.int.
  86.050000 8976.000000 10
  87.000000 7039.000000 8
  88.000000 3556.000000 4
  89.050000 1707.000000 2
  90.100000 4767.000000 5
  91.000000 2145.000000 2
  92.000000 418.000000 1
  93.000000 500.000000 1
  94.000000 42.000000 1
  95.000000 233.000000 1
  96.000000 686.000000 1
  97.100000 274.000000 1
  98.050000 2922.000000 3
  99.150000 2530.000000 3
  100.050000 172433.000000 187
  101.050000 24407.000000 26
  102.100000 13799.000000 15
  103.050000 6388.000000 7
  104.050000 1734.000000 2
  105.000000 1866.000000 2
  106.000000 292.000000 1
  107.000000 212.000000 1
  108.000000 98.000000 1
  109.000000 54.000000 1
  110.000000 350.000000 1
  111.000000 313.000000 1
  112.000000 978.000000 1
  113.100000 1770.000000 2
  114.100000 28842.000000 31
  115.100000 40370.000000 44
  116.100000 20695.000000 22
  117.050000 10593.000000 11
  118.050000 3411.000000 4
  119.050000 2351.000000 3
  120.050000 3251.000000 4
  121.000000 436.000000 1
  122.000000 358.000000 1
  123.000000 30.000000 1
  124.000000 57.000000 1
  125.000000 71.000000 1
  126.000000 434.000000 1
  127.100000 542.000000 1
  128.050000 3763.000000 4
  129.050000 10052.000000 11
  130.100000 10847.000000 12
  131.050000 26378.000000 29
  132.050000 21504.000000 23
  133.100000 20898.000000 23
  134.050000 4224.000000 5
  135.100000 2188.000000 2
  136.100000 266.000000 1
  137.100000 82.000000 1
  138.100000 34.000000 1
  139.100000 143.000000 1
  140.100000 415.000000 1
  141.100000 442.000000 1
  142.150000 2428.000000 3
  143.150000 915.000000 1
  144.100000 6254.000000 7
  145.150000 2442.000000 3
  146.100000 109222.000000 119
  147.100000 122828.000000 133
  148.100000 45922.000000 50
  149.150000 14415.000000 16
  150.100000 3474.000000 4
  151.100000 777.000000 1
  152.100000 142.000000 1
  153.100000 198.000000 1
  154.100000 274.000000 1
  155.100000 346.000000 1
  156.100000 972.000000 1
  157.100000 1102.000000 1
  158.050000 3452.000000 4
  159.150000 4101.000000 4
  160.100000 10457.000000 11
  161.100000 4372.000000 5
  162.150000 22003.000000 24
  163.150000 12015.000000 13
  164.150000 3510.000000 4
  165.100000 1103.000000 1
  166.100000 382.000000 1
  167.100000 193.000000 1
  168.100000 574.000000 1
  169.100000 212.000000 1
  170.100000 158.000000 1
  171.100000 345.000000 1
  172.100000 13390.000000 15
  173.100000 5202.000000 6
  174.100000 9518.000000 10
  175.050000 3305.000000 4
  176.000000 2030.000000 2
  177.000000 866.000000 1
  178.000000 409.000000 1
  179.000000 233.000000 1
  180.000000 11.000000 1
  181.000000 191.000000 1
  182.050000 1324.000000 1
  183.100000 670.000000 1
  184.100000 986.000000 1
  185.000000 1122.000000 1
  186.000000 937.000000 1
  187.100000 639.000000 1
  188.100000 46822.000000 51
  189.100000 9228.000000 10
  190.100000 10916.000000 12
  191.050000 3688.000000 4
  192.000000 1409.000000 2
  193.000000 1054.000000 1
  194.000000 218.000000 1
  195.000000 119.000000 1
  196.000000 116.000000 1
  197.000000 102.000000 1
  198.100000 398.000000 1
  199.050000 16517.000000 18
  200.050000 12285.000000 13
  201.050000 3446.000000 4
  202.050000 6732.000000 7
  203.050000 7366.000000 8
  204.050000 4288.000000 5
  205.050000 1846.000000 2
  206.050000 1149.000000 1
  207.000000 1546.000000 2
  208.000000 473.000000 1
  209.000000 295.000000 1
  210.000000 63.000000 1
  211.000000 127.000000 1
  212.000000 202.000000 1
  213.000000 215.000000 1
  214.000000 358.000000 1
  215.150000 1330.000000 1
  216.050000 78259.000000 85
  217.150000 31320.000000 34
  218.100000 920407.000000 999
  219.100000 192231.000000 209
  220.100000 91542.000000 99
  221.050000 17500.000000 19
  222.100000 5351.000000 6
  223.050000 1778.000000 2
  224.100000 658.000000 1
  225.100000 124.000000 1
  226.100000 186.000000 1
  227.100000 423.000000 1
  228.100000 436.000000 1
  229.100000 430.000000 1
  230.100000 2994.000000 3
  231.150000 10136.000000 11
  232.100000 106103.000000 115
  233.100000 23154.000000 25
  234.100000 10895.000000 12
  235.100000 1738.000000 2
  236.100000 5170.000000 6
  237.050000 1545.000000 2
  238.100000 764.000000 1
  239.100000 158.000000 1
  240.100000 118.000000 1
  241.100000 19.000000 1
  242.100000 233.000000 1
  243.100000 255.000000 1
  244.100000 481.000000 1
  245.100000 481.000000 1
  246.100000 2449.000000 3
  247.100000 1209.000000 1
  248.100000 7158.000000 8
  249.050000 3290.000000 4
  250.000000 4185.000000 5
  251.100000 1214.000000 1
  252.100000 606.000000 1
  253.100000 266.000000 1
  254.100000 30.000000 1
  255.100000 346.000000 1
  256.100000 602.000000 1
  257.100000 316.000000 1
  258.100000 287.000000 1
  259.200000 442.000000 1
  260.150000 28736.000000 31
  261.150000 8817.000000 10
  262.100000 44730.000000 49
  263.100000 12718.000000 14
  264.100000 20031.000000 22
  265.100000 44986.000000 49
  266.100000 11343.000000 12
  267.100000 5870.000000 6
  268.100000 1025.000000 1
  269.100000 350.000000 1
  270.100000 42.000000 1
  271.100000 538.000000 1
  272.100000 407.000000 1
  273.200000 1726.000000 2
  274.150000 1275.000000 1
  275.100000 727.000000 1
  276.100000 1268.000000 1
  277.150000 808.000000 1
  278.100000 10241.000000 11
  279.100000 3460.000000 4
  280.050000 1525.000000 2
  281.000000 674.000000 1
  282.000000 255.000000 1
  283.000000 154.000000 1
  284.000000 135.000000 1
  285.000000 71.000000 1
  286.000000 87.000000 1
  287.100000 412.000000 1
  288.150000 37656.000000 41
  289.150000 45852.000000 50
  290.150000 177276.000000 192
  291.100000 50743.000000 55
  292.100000 24948.000000 27
  293.150000 5633.000000 6
  294.100000 2447.000000 3
  295.100000 650.000000 1
  296.100000 500.000000 1
  297.100000 68.000000 1
  298.100000 39.000000 1
  299.100000 257.000000 1
  300.100000 198.000000 1
  301.100000 868.000000 1
  302.100000 788.000000 1
  303.100000 292.000000 1
  304.200000 1609.000000 2
  305.200000 798.000000 1
  306.200000 518.000000 1
  307.200000 542.000000 1
  308.200000 242.000000 1
  309.200000 201.000000 1
  310.200000 108.000000 1
  312.200000 8.000000 1
  313.200000 52.000000 1
  315.200000 214.000000 1
  316.200000 178.000000 1
  317.200000 476.000000 1
  318.200000 111.000000 1
  319.200000 401.000000 1
  320.200000 487.000000 1
  321.200000 225.000000 1
  322.200000 798.000000 1
  323.200000 186.000000 1
  324.200000 140.000000 1
  325.200000 14.000000 1
  326.200000 52.000000 1
  327.200000 201.000000 1
  328.200000 90.000000 1
  329.200000 19.000000 1
  330.200000 41.000000 1
  331.200000 175.000000 1
  332.200000 113.000000 1
  333.200000 510.000000 1
  334.200000 185.000000 1
  335.200000 306.000000 1
  336.200000 446.000000 1
  337.200000 108.000000 1
  338.200000 604.000000 1
  339.200000 100.000000 1
  340.200000 188.000000 1
  341.200000 55.000000 1
  342.200000 106.000000 1
  343.200000 34.000000 1
  345.200000 116.000000 1
  346.200000 241.000000 1
  347.200000 222.000000 1
  348.200000 26.000000 1
  349.200000 74.000000 1
  350.200000 71.000000 1
  351.200000 66.000000 1
  352.200000 94.000000 1
  353.200000 2.000000 1
  354.200000 71.000000 1
  355.200000 105.000000 1
  356.200000 62.000000 1
  357.200000 108.000000 1
  359.200000 42.000000 1
  360.200000 76.000000 1
  361.200000 2514.000000 3
  362.150000 934.000000 1
  363.150000 1519.000000 2
  364.100000 1289.000000 1
  365.100000 633.000000 1
  366.100000 233.000000 1
  367.100000 98.000000 1
  369.100000 119.000000 1
  371.100000 134.000000 1
  372.100000 81.000000 1
  373.100000 132.000000 1
  374.200000 1882.000000 2
  375.200000 834.000000 1
  376.200000 372.000000 1
  377.200000 388.000000 1
  378.200000 119.000000 1
  379.200000 8226.000000 9
  380.100000 2306.000000 3
  381.200000 1807.000000 2
  382.200000 351.000000 1
  383.200000 78.000000 1
  384.200000 89.000000 1
  385.200000 116.000000 1
  386.200000 33.000000 1
  387.200000 63.000000 1
  388.200000 36.000000 1
  389.200000 154.000000 1
  390.200000 215.000000 1
  391.150000 3200.000000 3
  392.150000 1511.000000 2
  393.100000 926.000000 1
  394.100000 262.000000 1
  395.100000 78.000000 1
  396.100000 57.000000 1
  397.100000 11.000000 1
  398.100000 24.000000 1
  399.100000 58.000000 1
  400.100000 103.000000 1
  401.100000 108.000000 1
  402.100000 10.000000 1
  403.100000 76.000000 1
  404.100000 6.000000 1
  405.100000 194.000000 1
  406.100000 394.000000 1
  407.150000 14769.000000 16
  408.150000 5449.000000 6
  409.150000 3376.000000 4
  410.100000 812.000000 1
  411.100000 162.000000 1
  412.100000 2.000000 1
  413.100000 76.000000 1
  414.100000 159.000000 1
  415.100000 84.000000 1
  416.100000 94.000000 1
  417.100000 50.000000 1
  418.100000 58.000000 1
  419.100000 26.000000 1
  420.100000 151.000000 1
  421.100000 33.000000 1
  422.100000 167.000000 1
  424.100000 198.000000 1
  425.100000 66.000000 1
  426.100000 65.000000 1
  427.100000 81.000000 1
  428.100000 14.000000 1
  429.100000 54.000000 1
  430.100000 71.000000 1
  431.100000 84.000000 1
  432.100000 81.000000 1
  433.100000 27.000000 1
  435.100000 142.000000 1
  436.100000 65.000000 1
  439.100000 102.000000 1
  440.100000 54.000000 1
  441.100000 6.000000 1
  442.100000 49.000000 1
  443.100000 150.000000 1
  444.100000 68.000000 1
  445.100000 124.000000 1
  446.100000 65.000000 1
  447.100000 46.000000 1
  449.100000 41.000000 1
  450.100000 82.000000 1
  451.100000 90.000000 1
  452.100000 124.000000 1
  453.100000 66.000000 1
  454.100000 124.000000 1
  455.100000 105.000000 1
  456.100000 79.000000 1
  458.100000 8.000000 1
  459.100000 24.000000 1
  460.100000 29.000000 1
  462.100000 98.000000 1
  463.100000 116.000000 1
  464.100000 169.000000 1
  465.100000 29.000000 1
  466.100000 137.000000 1
  467.100000 26.000000 1
  468.100000 29.000000 1
  469.100000 5.000000 1
  470.100000 135.000000 1
  472.100000 90.000000 1
  473.100000 27.000000 1
  474.100000 92.000000 1
  475.100000 90.000000 1
  476.100000 90.000000 1
  477.100000 6.000000 1
  478.100000 49.000000 1
  479.100000 660.000000 1
  480.100000 209.000000 1
  481.200000 1142.000000 1
  482.200000 626.000000 1
  483.200000 239.000000 1
  484.200000 161.000000 1
  485.200000 54.000000 1
  486.200000 33.000000 1
  488.200000 52.000000 1
  489.200000 13.000000 1
  490.200000 18.000000 1
  493.200000 6.000000 1
  494.200000 212.000000 1
  495.200000 282.000000 1
  496.200000 2798.000000 3
  497.250000 1826.000000 2
  498.200000 1318.000000 1
  499.200000 532.000000 1