ACCESSION: MSBNK-GL_Sciences_Inc-GLS00104
RECORD_TITLE: 1-Methylhistamine; EI-B; MS; n TMS; RT: 725.40 s
DATE: 2016.01.19 (Created 2012.08.03, modified 2013.07.31)
AUTHORS: Miyagawa H, Akimoto S, Yamasaki K, GL Sciences Inc.
LICENSE: CC BY-SA
COPYRIGHT: GLS
COMMENT: The chemical compound was chemically modified with N-methyl-N-trimethylsilyl-trifluoroacetamide(MSTFA) before GC-MS analysis. When it has two or more functional groups, this modification gave a mixture of the TMS derivatives having different number of TMS groups at different functional groups.

CH$NAME: 1-Methylhistamine
CH$COMPOUND_CLASS: Natural Product
CH$FORMULA: C6H11N3
CH$EXACT_MASS: 125.09530
CH$SMILES: NCCc(n1)cn(C)c1
CH$IUPAC: InChI=1S/C6H11N3/c1-9-4-6(2-3-7)8-5-9/h4-5H,2-3,7H2,1H3
CH$LINK: CAS 501-75-7
CH$LINK: CHEBI 29009
CH$LINK: KEGG C05127
CH$LINK: PUBCHEM 7548
CH$LINK: INCHIKEY FHQDWPCFSJMNCT-UHFFFAOYSA-N
CH$LINK: COMPTOX DTXSID30198207

AC$INSTRUMENT: GCMS-2010 Plus, Shimadzu
AC$INSTRUMENT_TYPE: EI-B
AC$MASS_SPECTROMETRY: MS_TYPE MS
AC$MASS_SPECTROMETRY: ION_MODE POSITIVE
AC$MASS_SPECTROMETRY: GAS_PRESSURE 75 kPa
AC$MASS_SPECTROMETRY: ION_SOURCE_TEMPERATURE 200 C
AC$MASS_SPECTROMETRY: SCAN_RANGE_M/Z 85-500
AC$CHROMATOGRAPHY: COLUMN_NAME InertCap 5MS/NP 0.25 mmI.D. x 30 m, df=0.25 um
AC$CHROMATOGRAPHY: INJECTION_TEMPERATURE 230 C
AC$CHROMATOGRAPHY: OVEN_TEMPERATURE 80 C(2 min)-15 C/min - 330C
AC$CHROMATOGRAPHY: RETENTION_INDEX 1776
AC$CHROMATOGRAPHY: RETENTION_TIME 718.23
AC$CHROMATOGRAPHY: TRANSFARLINE_TEMPERATURE 250 C

MS$FOCUSED_ION: DERIVATIVE_TYPE n TMS
MS$DATA_PROCESSING: WHOLE GCMSsolution

PK$SPLASH: splash10-00di-2910000000-3458f7def44a74d73f7b
PK$NUM_PEAK: 370
PK$PEAK: m/z int. rel.int.
  86.050000 209242.000000 415
  87.100000 19154.000000 38
  88.050000 8518.000000 17
  89.000000 698.000000 1
  90.000000 314.000000 1
  91.250000 991.000000 2
  92.200000 241.000000 1
  93.200000 394.000000 1
  94.100000 634.000000 1
  95.100000 16199.000000 32
  96.050000 16640.000000 33
  97.050000 9323.000000 18
  98.100000 5302.000000 11
  99.150000 2719.000000 5
  100.100000 109913.000000 218
  101.100000 13167.000000 26
  102.100000 9705.000000 19
  103.150000 1575.000000 3
  104.100000 698.000000 1
  105.100000 337.000000 1
  106.100000 191.000000 1
  107.150000 1694.000000 3
  108.100000 3794.000000 8
  109.100000 4294.000000 9
  110.150000 2286.000000 5
  111.150000 1998.000000 4
  112.100000 11338.000000 22
  113.100000 4287.000000 8
  114.100000 3670.000000 7
  115.100000 1945.000000 4
  116.050000 5998.000000 12
  117.100000 6548.000000 13
  118.150000 1320.000000 3
  119.600000 8031.000000 16
  120.550000 1317.000000 3
  121.600000 161.000000 1
  122.600000 236.000000 1
  123.600000 391.000000 1
  125.100000 1302.000000 3
  126.100000 8498.000000 17
  127.100000 3033.000000 6
  128.100000 974.000000 2
  129.150000 1242.000000 2
  130.100000 25497.000000 51
  131.100000 7082.000000 14
  132.100000 4033.000000 8
  133.100000 722.000000 1
  134.100000 193.000000 1
  135.100000 1183.000000 2
  136.100000 436.000000 1
  137.100000 1220.000000 2
  138.150000 853.000000 2
  139.100000 3940.000000 8
  140.150000 1438.000000 3
  141.150000 1350.000000 3
  142.200000 654.000000 1
  143.100000 436.000000 1
  144.100000 1822.000000 4
  145.200000 578.000000 1
  146.150000 12235.000000 24
  147.150000 2464.000000 5
  148.100000 1305.000000 3
  149.100000 529.000000 1
  150.050000 1179.000000 2
  151.150000 1584.000000 3
  152.100000 695.000000 1
  153.100000 4193.000000 8
  154.100000 1578.000000 3
  155.150000 1146.000000 2
  156.100000 652.000000 1
  157.100000 260.000000 1
  158.150000 2625.000000 5
  159.200000 394.000000 1
  160.150000 1026.000000 2
  161.100000 244.000000 1
  162.100000 345.000000 1
  163.100000 177.000000 1
  164.100000 718.000000 1
  165.150000 2496.000000 5
  166.150000 2023.000000 4
  167.150000 3307.000000 7
  168.150000 86981.000000 172
  169.150000 13901.000000 28
  170.150000 5309.000000 11
  171.100000 665.000000 1
  172.150000 5875.000000 12
  173.150000 2491.000000 5
  174.150000 503959.000000 999
  175.150000 84115.000000 167
  176.150000 39019.000000 77
  177.150000 4573.000000 9
  178.050000 1483.000000 3
  179.100000 652.000000 1
  180.100000 16332.000000 32
  181.100000 3686.000000 7
  182.150000 4779.000000 9
  183.150000 1149.000000 2
  184.200000 385.000000 1
  185.200000 254.000000 1
  186.200000 110.000000 1
  187.200000 170.000000 1
  188.200000 198.000000 1
  189.200000 74.000000 1
  190.200000 182.000000 1
  191.200000 92.000000 1
  192.200000 202.000000 1
  193.200000 103.000000 1
  194.200000 876.000000 2
  195.100000 638.000000 1
  196.100000 3324.000000 7
  197.100000 770.000000 2
  198.100000 201.000000 1
  199.100000 433.000000 1
  200.100000 119.000000 1
  201.100000 41.000000 1
  202.100000 122.000000 1
  203.100000 2.000000 1
  204.100000 73.000000 1
  206.100000 151.000000 1
  207.100000 84.000000 1
  208.100000 281.000000 1
  209.100000 108.000000 1
  210.100000 369.000000 1
  211.100000 362.000000 1
  212.100000 212.000000 1
  213.100000 110.000000 1
  214.100000 121.000000 1
  215.100000 86.000000 1
  216.100000 46.000000 1
  217.100000 82.000000 1
  218.100000 57.000000 1
  219.100000 425.000000 1
  220.100000 27.000000 1
  221.100000 31.000000 1
  222.100000 662.000000 1
  223.100000 266.000000 1
  224.100000 1049.000000 2
  225.100000 407.000000 1
  226.100000 215.000000 1
  227.100000 24.000000 1
  228.100000 92.000000 1
  230.100000 13.000000 1
  231.100000 86.000000 1
  232.100000 10.000000 1
  234.100000 66.000000 1
  235.100000 29.000000 1
  236.100000 242.000000 1
  237.100000 305.000000 1
  238.100000 2078.000000 4
  239.100000 583.000000 1
  240.100000 322.000000 1
  241.100000 31.000000 1
  242.100000 102.000000 1
  243.100000 52.000000 1
  244.100000 31.000000 1
  245.100000 31.000000 1
  249.100000 105.000000 1
  250.100000 86.000000 1
  251.100000 6.000000 1
  252.150000 2151.000000 4
  253.250000 1563.000000 3
  254.200000 117559.000000 233
  255.200000 27057.000000 54
  256.150000 10398.000000 21
  257.200000 1529.000000 3
  258.200000 228.000000 1
  259.200000 102.000000 1
  260.200000 8.000000 1
  261.200000 124.000000 1
  262.200000 11.000000 1
  263.200000 19.000000 1
  264.200000 177.000000 1
  265.200000 47.000000 1
  266.200000 234.000000 1
  267.200000 204.000000 1
  268.250000 2737.000000 5
  269.200000 1334.000000 3
  270.200000 550.000000 1
  271.200000 100.000000 1
  272.200000 79.000000 1
  273.200000 5.000000 1
  274.200000 22.000000 1
  277.200000 222.000000 1
  278.200000 74.000000 1
  279.200000 46.000000 1
  280.200000 18.000000 1
  281.200000 122.000000 1
  282.200000 70.000000 1
  283.200000 73.000000 1
  284.200000 66.000000 1
  285.200000 60.000000 1
  286.200000 21.000000 1
  287.200000 84.000000 1
  290.200000 22.000000 1
  292.200000 29.000000 1
  294.200000 105.000000 1
  296.200000 118.000000 1
  297.200000 44.000000 1
  298.200000 30.000000 1
  300.200000 79.000000 1
  302.200000 36.000000 1
  303.200000 30.000000 1
  305.200000 63.000000 1
  307.200000 13.000000 1
  308.200000 10.000000 1
  310.200000 82.000000 1
  311.200000 58.000000 1
  312.200000 57.000000 1
  314.200000 24.000000 1
  315.200000 86.000000 1
  316.200000 82.000000 1
  317.200000 62.000000 1
  318.200000 6.000000 1
  319.200000 161.000000 1
  320.200000 29.000000 1
  321.200000 21.000000 1
  323.200000 46.000000 1
  324.200000 92.000000 1
  325.200000 3.000000 1
  326.200000 57.000000 1
  327.200000 16.000000 1
  328.200000 87.000000 1
  329.200000 44.000000 1
  330.200000 41.000000 1
  331.200000 97.000000 1
  332.200000 63.000000 1
  333.200000 44.000000 1
  335.200000 105.000000 1
  336.200000 78.000000 1
  337.200000 98.000000 1
  338.200000 49.000000 1
  339.200000 55.000000 1
  341.200000 19.000000 1
  342.200000 154.000000 1
  343.200000 22.000000 1
  345.200000 130.000000 1
  347.200000 55.000000 1
  348.200000 52.000000 1
  349.200000 54.000000 1
  350.200000 57.000000 1
  351.200000 94.000000 1
  352.200000 38.000000 1
  354.200000 86.000000 1
  355.200000 113.000000 1
  356.200000 3.000000 1
  357.200000 29.000000 1
  358.200000 68.000000 1
  359.200000 87.000000 1
  360.200000 89.000000 1
  361.200000 106.000000 1
  362.200000 82.000000 1
  363.200000 31.000000 1
  364.200000 44.000000 1
  365.200000 18.000000 1
  366.200000 13.000000 1
  367.200000 62.000000 1
  368.200000 5.000000 1
  369.200000 52.000000 1
  370.200000 14.000000 1
  371.200000 26.000000 1
  373.200000 95.000000 1
  374.200000 58.000000 1
  375.200000 27.000000 1
  377.200000 41.000000 1
  379.200000 57.000000 1
  380.200000 19.000000 1
  381.200000 86.000000 1
  382.200000 29.000000 1
  383.200000 8.000000 1
  384.200000 47.000000 1
  385.200000 42.000000 1
  386.200000 74.000000 1
  387.200000 19.000000 1
  388.200000 14.000000 1
  389.200000 57.000000 1
  391.200000 178.000000 1
  392.200000 113.000000 1
  393.200000 52.000000 1
  394.200000 82.000000 1
  395.200000 18.000000 1
  396.200000 71.000000 1
  397.200000 74.000000 1
  399.200000 74.000000 1
  400.200000 38.000000 1
  401.200000 8.000000 1
  402.200000 108.000000 1
  403.200000 146.000000 1
  404.200000 73.000000 1
  405.200000 145.000000 1
  406.200000 31.000000 1
  407.200000 50.000000 1
  409.200000 159.000000 1
  410.200000 97.000000 1
  411.200000 36.000000 1
  412.200000 8.000000 1
  413.200000 41.000000 1
  414.200000 39.000000 1
  415.200000 167.000000 1
  416.200000 68.000000 1
  418.200000 14.000000 1
  419.200000 81.000000 1
  420.200000 66.000000 1
  421.200000 63.000000 1
  422.200000 55.000000 1
  423.200000 63.000000 1
  424.200000 89.000000 1
  426.200000 81.000000 1
  427.200000 44.000000 1
  428.200000 27.000000 1
  429.200000 100.000000 1
  432.200000 41.000000 1
  433.200000 34.000000 1
  434.200000 78.000000 1
  435.200000 36.000000 1
  437.200000 24.000000 1
  438.200000 29.000000 1
  439.200000 27.000000 1
  440.200000 92.000000 1
  441.200000 13.000000 1
  442.200000 63.000000 1
  443.200000 44.000000 1
  444.200000 86.000000 1
  445.200000 47.000000 1
  446.200000 97.000000 1
  447.200000 78.000000 1
  449.200000 42.000000 1
  450.200000 10.000000 1
  451.200000 31.000000 1
  452.200000 10.000000 1
  453.200000 26.000000 1
  454.200000 10.000000 1
  455.200000 49.000000 1
  456.200000 13.000000 1
  457.200000 129.000000 1
  458.200000 68.000000 1
  459.200000 86.000000 1
  460.200000 62.000000 1
  461.200000 89.000000 1
  463.200000 63.000000 1
  465.200000 31.000000 1
  466.200000 82.000000 1
  468.200000 11.000000 1
  469.200000 97.000000 1
  470.200000 63.000000 1
  471.200000 74.000000 1
  472.200000 33.000000 1
  473.200000 57.000000 1
  474.200000 18.000000 1
  475.200000 29.000000 1
  476.200000 27.000000 1
  477.200000 47.000000 1
  478.200000 33.000000 1
  479.200000 105.000000 1
  480.200000 11.000000 1
  481.200000 5.000000 1
  482.200000 57.000000 1
  484.200000 18.000000 1
  486.200000 60.000000 1
  487.200000 27.000000 1
  488.200000 126.000000 1
  489.200000 39.000000 1
  490.200000 14.000000 1
  491.200000 63.000000 1
  492.200000 78.000000 1
  493.200000 97.000000 1
  494.200000 34.000000 1
  495.200000 74.000000 1
  496.200000 76.000000 1
  497.200000 11.000000 1
  498.200000 60.000000 1