ACCESSION: MSBNK-GL_Sciences_Inc-GLS00109
RECORD_TITLE: 1-Methyl Histidine; EI-B; MS; 2 TMS; RT: 740.88 s
DATE: 2016.01.19 (Created 2012.08.03, modified 2013.07.31)
AUTHORS: Miyagawa H, Akimoto S, Yamasaki K, GL Sciences Inc.
LICENSE: CC BY-SA
COPYRIGHT: GLS
COMMENT: The chemical compound was chemically modified with N-methyl-N-trimethylsilyl-trifluoroacetamide(MSTFA) before GC-MS analysis. When it has two or more functional groups, this modification gave a mixture of the TMS derivatives having different number of TMS groups at different functional groups.

CH$NAME: 1-Methyl Histidine
CH$COMPOUND_CLASS: Natural Product
CH$FORMULA: C7H11N3O2
CH$EXACT_MASS: 169.08513
CH$SMILES: OC(=O)C(N)Cc(n1)cn(C)c1
CH$IUPAC: InChI=1S/C7H11N3O2/c1-10-3-5(9-4-10)2-6(8)7(11)12/h3-4,6H,2,8H2,1H3,(H,11,12)
CH$LINK: CAS 332-80-9
CH$LINK: CHEBI 170709
CH$LINK: INCHIKEY BRMWTNUJHUMWMS-UHFFFAOYSA-N

AC$INSTRUMENT: GCMS-2010 Plus, Shimadzu
AC$INSTRUMENT_TYPE: EI-B
AC$MASS_SPECTROMETRY: MS_TYPE MS
AC$MASS_SPECTROMETRY: ION_MODE POSITIVE
AC$MASS_SPECTROMETRY: GAS_PRESSURE 75 kPa
AC$MASS_SPECTROMETRY: ION_SOURCE_TEMPERATURE 200 C
AC$MASS_SPECTROMETRY: SCAN_RANGE_M/Z 85-500
AC$CHROMATOGRAPHY: COLUMN_NAME InertCap 5MS/NP 0.25 mmI.D. x 30 m, df=0.25 um
AC$CHROMATOGRAPHY: INJECTION_TEMPERATURE 230 C
AC$CHROMATOGRAPHY: OVEN_TEMPERATURE 80 C(2 min)-15 C/min - 330C
AC$CHROMATOGRAPHY: RETENTION_INDEX 1825
AC$CHROMATOGRAPHY: RETENTION_TIME 740.88
AC$CHROMATOGRAPHY: TRANSFARLINE_TEMPERATURE 250 C

MS$FOCUSED_ION: DERIVATIVE_TYPE 2 TMS
MS$DATA_PROCESSING: WHOLE GCMSsolution

PK$SPLASH: splash10-0002-8920000000-b86518dde0ca517cf860
PK$NUM_PEAK: 374
PK$PEAK: m/z int. rel.int.
  85.900000 609.000000 6
  86.900000 382.000000 4
  87.900000 138.000000 1
  88.900000 334.000000 3
  89.900000 81.000000 1
  90.900000 106.000000 1
  91.900000 73.000000 1
  92.900000 276.000000 3
  93.900000 270.000000 2
  95.100000 8079.000000 75
  96.100000 108308.000000 999
  97.100000 29190.000000 269
  98.150000 2281.000000 21
  99.100000 393.000000 4
  100.100000 11620.000000 107
  101.100000 1602.000000 15
  102.100000 690.000000 6
  103.100000 422.000000 4
  104.100000 273.000000 3
  105.100000 153.000000 1
  106.100000 282.000000 3
  107.100000 562.000000 5
  108.100000 319.000000 3
  109.100000 646.000000 6
  110.100000 375.000000 3
  111.100000 247.000000 2
  112.150000 1425.000000 13
  113.100000 497.000000 5
  114.100000 239.000000 2
  115.100000 466.000000 4
  116.100000 132.000000 1
  117.100000 678.000000 6
  118.100000 140.000000 1
  119.100000 278.000000 3
  120.100000 118.000000 1
  121.100000 186.000000 2
  122.100000 393.000000 4
  123.100000 425.000000 4
  124.150000 8350.000000 77
  125.150000 1348.000000 12
  126.200000 742.000000 7
  127.200000 247.000000 2
  128.200000 615.000000 6
  129.200000 146.000000 1
  130.150000 1327.000000 12
  131.100000 1300.000000 12
  132.100000 1174.000000 11
  133.200000 1466.000000 14
  134.200000 558.000000 5
  135.200000 809.000000 7
  136.200000 366.000000 3
  137.200000 308.000000 3
  138.200000 126.000000 1
  139.150000 1842.000000 17
  140.100000 486.000000 4
  141.100000 487.000000 4
  142.100000 207.000000 2
  143.100000 178.000000 2
  144.100000 311.000000 3
  145.100000 87.000000 1
  146.200000 135.000000 1
  147.200000 7158.000000 66
  148.200000 1158.000000 11
  149.200000 790.000000 7
  150.200000 742.000000 7
  151.200000 338.000000 3
  152.200000 247.000000 2
  153.200000 529.000000 5
  154.200000 193.000000 2
  155.200000 498.000000 5
  156.200000 103.000000 1
  157.200000 127.000000 1
  158.200000 183.000000 2
  159.200000 300.000000 3
  160.200000 303.000000 3
  161.200000 52.000000 1
  162.200000 65.000000 1
  163.200000 678.000000 6
  164.200000 316.000000 3
  165.200000 810.000000 7
  166.200000 292.000000 3
  167.200000 625.000000 6
  168.150000 6227.000000 57
  169.200000 1332.000000 12
  170.200000 570.000000 5
  171.200000 161.000000 1
  172.200000 126.000000 1
  173.200000 135.000000 1
  174.200000 452.000000 4
  175.200000 111.000000 1
  176.200000 143.000000 1
  177.200000 68.000000 1
  178.200000 135.000000 1
  179.200000 287.000000 3
  180.200000 12100.000000 112
  181.150000 2671.000000 25
  182.200000 751.000000 7
  183.200000 167.000000 2
  184.200000 60.000000 1
  185.200000 226.000000 2
  186.200000 18.000000 1
  187.200000 108.000000 1
  188.200000 66.000000 1
  189.200000 148.000000 1
  190.200000 306.000000 3
  191.200000 215.000000 2
  192.200000 87.000000 1
  193.200000 100.000000 1
  194.200000 447.000000 4
  195.200000 492.000000 5
  196.150000 51676.000000 477
  197.150000 8352.000000 77
  198.200000 2462.000000 23
  199.150000 1794.000000 17
  200.100000 455.000000 4
  201.100000 122.000000 1
  202.100000 306.000000 3
  203.100000 282.000000 3
  204.100000 185.000000 2
  205.100000 190.000000 2
  206.100000 103.000000 1
  207.100000 289.000000 3
  208.100000 3106.000000 29
  209.100000 841.000000 8
  210.100000 311.000000 3
  211.100000 94.000000 1
  213.100000 135.000000 1
  214.100000 39.000000 1
  215.100000 5.000000 1
  216.100000 154.000000 1
  217.200000 284.000000 3
  218.150000 14026.000000 129
  219.150000 2919.000000 27
  220.200000 1454.000000 13
  221.200000 183.000000 2
  222.200000 249.000000 2
  223.200000 524.000000 5
  224.200000 860.000000 8
  225.200000 233.000000 2
  226.200000 89.000000 1
  227.200000 121.000000 1
  228.200000 94.000000 1
  229.200000 68.000000 1
  230.200000 90.000000 1
  231.200000 132.000000 1
  232.200000 177.000000 2
  233.200000 52.000000 1
  234.200000 71.000000 1
  235.200000 55.000000 1
  236.200000 16.000000 1
  238.200000 180.000000 2
  239.200000 103.000000 1
  240.200000 108.000000 1
  241.200000 55.000000 1
  242.200000 60.000000 1
  244.200000 225.000000 2
  245.200000 214.000000 2
  246.200000 126.000000 1
  247.200000 38.000000 1
  248.200000 11.000000 1
  249.200000 81.000000 1
  250.200000 22.000000 1
  251.200000 39.000000 1
  252.200000 113.000000 1
  253.200000 209.000000 2
  254.200000 170.000000 2
  255.200000 49.000000 1
  256.200000 90.000000 1
  257.200000 314.000000 3
  258.200000 135.000000 1
  259.200000 102.000000 1
  260.200000 90.000000 1
  262.200000 24.000000 1
  263.200000 44.000000 1
  264.200000 36.000000 1
  265.200000 33.000000 1
  266.200000 110.000000 1
  268.200000 134.000000 1
  269.200000 73.000000 1
  270.250000 2768.000000 26
  271.200000 722.000000 7
  272.200000 303.000000 3
  273.200000 78.000000 1
  274.200000 57.000000 1
  276.200000 130.000000 1
  278.200000 30.000000 1
  279.200000 66.000000 1
  280.200000 719.000000 7
  281.200000 265.000000 2
  282.200000 270.000000 2
  283.200000 102.000000 1
  284.200000 111.000000 1
  285.200000 146.000000 1
  286.200000 65.000000 1
  287.200000 21.000000 1
  288.200000 129.000000 1
  289.200000 33.000000 1
  290.200000 10.000000 1
  291.200000 76.000000 1
  292.200000 18.000000 1
  293.200000 78.000000 1
  294.200000 27.000000 1
  295.200000 201.000000 2
  296.200000 186.000000 2
  297.200000 132.000000 1
  298.250000 2246.000000 21
  299.200000 558.000000 5
  300.200000 495.000000 5
  301.200000 102.000000 1
  302.200000 170.000000 2
  303.200000 79.000000 1
  304.200000 29.000000 1
  305.200000 65.000000 1
  306.200000 114.000000 1
  307.200000 105.000000 1
  308.200000 71.000000 1
  309.200000 124.000000 1
  310.200000 36.000000 1
  311.200000 71.000000 1
  312.200000 50.000000 1
  313.300000 2079.000000 19
  314.200000 1098.000000 10
  315.200000 322.000000 3
  316.200000 228.000000 2
  317.200000 127.000000 1
  318.200000 113.000000 1
  319.200000 33.000000 1
  320.200000 95.000000 1
  321.200000 42.000000 1
  322.200000 27.000000 1
  323.200000 11.000000 1
  324.200000 54.000000 1
  325.200000 22.000000 1
  326.200000 13.000000 1
  327.200000 63.000000 1
  328.200000 118.000000 1
  329.200000 90.000000 1
  330.200000 127.000000 1
  331.200000 174.000000 2
  332.200000 82.000000 1
  333.200000 172.000000 2
  334.200000 118.000000 1
  335.200000 13.000000 1
  336.200000 122.000000 1
  337.200000 11.000000 1
  338.200000 79.000000 1
  339.200000 31.000000 1
  340.200000 52.000000 1
  341.200000 95.000000 1
  342.200000 169.000000 2
  343.200000 105.000000 1
  344.200000 57.000000 1
  345.200000 73.000000 1
  346.200000 36.000000 1
  347.200000 82.000000 1
  349.200000 113.000000 1
  350.200000 34.000000 1
  351.200000 11.000000 1
  352.200000 19.000000 1
  354.200000 74.000000 1
  355.200000 210.000000 2
  356.200000 57.000000 1
  357.200000 62.000000 1
  358.200000 74.000000 1
  359.200000 19.000000 1
  360.200000 3.000000 1
  361.200000 27.000000 1
  362.200000 70.000000 1
  363.200000 41.000000 1
  364.200000 57.000000 1
  367.200000 14.000000 1
  368.200000 70.000000 1
  369.200000 31.000000 1
  370.200000 134.000000 1
  371.200000 70.000000 1
  372.200000 100.000000 1
  374.200000 113.000000 1
  375.200000 111.000000 1
  377.200000 68.000000 1
  378.200000 110.000000 1
  379.200000 39.000000 1
  381.200000 44.000000 1
  383.200000 94.000000 1
  384.200000 36.000000 1
  385.200000 57.000000 1
  386.200000 127.000000 1
  387.200000 129.000000 1
  388.200000 21.000000 1
  389.200000 92.000000 1
  390.200000 74.000000 1
  391.200000 41.000000 1
  392.200000 14.000000 1
  393.200000 70.000000 1
  394.200000 71.000000 1
  395.200000 13.000000 1
  396.200000 46.000000 1
  398.200000 57.000000 1
  399.200000 76.000000 1
  402.200000 98.000000 1
  403.200000 92.000000 1
  404.200000 58.000000 1
  405.200000 42.000000 1
  407.200000 55.000000 1
  408.200000 24.000000 1
  409.200000 34.000000 1
  412.200000 16.000000 1
  415.200000 30.000000 1
  416.200000 14.000000 1
  417.200000 337.000000 3
  418.200000 209.000000 2
  419.200000 49.000000 1
  420.200000 26.000000 1
  422.200000 29.000000 1
  424.200000 90.000000 1
  425.200000 38.000000 1
  427.200000 60.000000 1
  428.200000 153.000000 1
  429.200000 78.000000 1
  432.200000 190.000000 2
  433.200000 90.000000 1
  434.200000 66.000000 1
  436.200000 36.000000 1
  438.200000 39.000000 1
  439.200000 34.000000 1
  441.200000 49.000000 1
  443.200000 30.000000 1
  444.200000 52.000000 1
  445.200000 41.000000 1
  446.200000 18.000000 1
  447.200000 81.000000 1
  448.200000 65.000000 1
  449.200000 70.000000 1
  450.200000 2.000000 1
  451.200000 97.000000 1
  452.200000 68.000000 1
  453.200000 94.000000 1
  454.200000 118.000000 1
  455.200000 26.000000 1
  456.200000 58.000000 1
  457.200000 16.000000 1
  459.200000 116.000000 1
  460.200000 30.000000 1
  461.200000 143.000000 1
  462.200000 39.000000 1
  463.200000 76.000000 1
  464.200000 16.000000 1
  465.200000 47.000000 1
  466.200000 50.000000 1
  467.200000 21.000000 1
  468.200000 114.000000 1
  469.200000 38.000000 1
  470.200000 98.000000 1
  472.200000 13.000000 1
  474.200000 50.000000 1
  475.200000 46.000000 1
  476.200000 132.000000 1
  477.200000 26.000000 1
  478.200000 142.000000 1
  479.200000 87.000000 1
  481.200000 3.000000 1
  482.200000 26.000000 1
  483.200000 47.000000 1
  484.200000 47.000000 1
  486.200000 86.000000 1
  487.200000 55.000000 1
  488.200000 36.000000 1
  489.200000 19.000000 1
  491.200000 78.000000 1
  492.200000 100.000000 1
  493.200000 138.000000 1
  494.200000 11.000000 1
  496.200000 137.000000 1
  497.200000 84.000000 1
  498.200000 3.000000 1