ACCESSION: MSBNK-GL_Sciences_Inc-GLS00113
RECORD_TITLE: 1-Methyl Histidine; EI-B; MS; 3 TMS; RT: 846.76 s
DATE: 2016.01.19 (Created 2012.08.03, modified 2013.07.31)
AUTHORS: Miyagawa H, Akimoto S, Yamasaki K, GL Sciences Inc.
LICENSE: CC BY-SA
COPYRIGHT: GLS
COMMENT: The chemical compound was chemically modified with N-methyl-N-trimethylsilyl-trifluoroacetamide(MSTFA) before GC-MS analysis. When it has two or more functional groups, this modification gave a mixture of the TMS derivatives having different number of TMS groups at different functional groups.

CH$NAME: 1-Methyl Histidine
CH$COMPOUND_CLASS: Natural Product
CH$FORMULA: C7H11N3O2
CH$EXACT_MASS: 169.08513
CH$SMILES: OC(=O)C(N)Cc(n1)cn(C)c1
CH$IUPAC: InChI=1S/C7H11N3O2/c1-10-3-5(9-4-10)2-6(8)7(11)12/h3-4,6H,2,8H2,1H3,(H,11,12)
CH$LINK: CAS 332-80-9
CH$LINK: CHEBI 170709
CH$LINK: INCHIKEY BRMWTNUJHUMWMS-UHFFFAOYSA-N

AC$INSTRUMENT: GCMS-2010 Plus, Shimadzu
AC$INSTRUMENT_TYPE: EI-B
AC$MASS_SPECTROMETRY: MS_TYPE MS
AC$MASS_SPECTROMETRY: ION_MODE POSITIVE
AC$MASS_SPECTROMETRY: GAS_PRESSURE 75 kPa
AC$MASS_SPECTROMETRY: ION_SOURCE_TEMPERATURE 200 C
AC$MASS_SPECTROMETRY: SCAN_RANGE_M/Z 85-500
AC$CHROMATOGRAPHY: COLUMN_NAME InertCap 5MS/NP 0.25 mmI.D. x 30 m, df=0.25 um
AC$CHROMATOGRAPHY: INJECTION_TEMPERATURE 230 C
AC$CHROMATOGRAPHY: OVEN_TEMPERATURE 80 C(2 min)-15 C/min - 330C
AC$CHROMATOGRAPHY: RETENTION_INDEX 2074
AC$CHROMATOGRAPHY: RETENTION_TIME 846.76
AC$CHROMATOGRAPHY: TRANSFARLINE_TEMPERATURE 250 C

MS$FOCUSED_ION: DERIVATIVE_TYPE 3 TMS
MS$DATA_PROCESSING: WHOLE GCMSsolution

PK$SPLASH: splash10-014l-1982000000-d07b3cb21fdc812d8437
PK$NUM_PEAK: 376
PK$PEAK: m/z int. rel.int.
  86.200000 982.000000 13
  87.200000 327.000000 4
  88.200000 295.000000 4
  89.200000 231.000000 3
  90.200000 129.000000 2
  91.200000 114.000000 2
  92.200000 82.000000 1
  93.200000 193.000000 3
  94.100000 223.000000 3
  95.100000 19566.000000 265
  96.100000 15465.000000 209
  97.100000 6974.000000 94
  98.150000 1251.000000 17
  99.100000 639.000000 9
  100.100000 33212.000000 449
  101.100000 3831.000000 52
  102.150000 1567.000000 21
  103.100000 2868.000000 39
  104.100000 762.000000 10
  105.100000 474.000000 6
  106.100000 206.000000 3
  107.100000 844.000000 11
  108.100000 439.000000 6
  109.100000 567.000000 8
  110.100000 585.000000 8
  111.100000 470.000000 6
  112.050000 3629.000000 49
  113.100000 1038.000000 14
  114.100000 1084.000000 15
  115.100000 514.000000 7
  116.100000 610.000000 8
  117.100000 961.000000 13
  118.100000 382.000000 5
  119.100000 521.000000 7
  120.100000 97.000000 1
  121.100000 230.000000 3
  122.100000 362.000000 5
  123.100000 378.000000 5
  124.150000 1349.000000 18
  125.100000 596.000000 8
  126.150000 3012.000000 41
  127.100000 852.000000 12
  128.100000 431.000000 6
  129.100000 398.000000 5
  130.100000 3022.000000 41
  131.100000 3122.000000 42
  132.150000 1219.000000 16
  133.150000 3590.000000 49
  134.100000 774.000000 10
  135.150000 1228.000000 17
  136.200000 247.000000 3
  137.200000 519.000000 7
  138.200000 226.000000 3
  139.100000 1665.000000 23
  140.100000 700.000000 9
  141.100000 450.000000 6
  142.100000 386.000000 5
  143.100000 220.000000 3
  144.100000 217.000000 3
  145.100000 145.000000 2
  146.250000 931.000000 13
  147.150000 25753.000000 348
  148.150000 3932.000000 53
  149.150000 2063.000000 28
  150.200000 513.000000 7
  151.200000 863.000000 12
  152.200000 284.000000 4
  153.200000 2646.000000 36
  154.200000 714.000000 10
  155.200000 337.000000 5
  156.200000 241.000000 3
  157.200000 191.000000 3
  158.200000 324.000000 4
  159.200000 342.000000 5
  160.200000 434.000000 6
  161.200000 170.000000 2
  162.200000 89.000000 1
  163.200000 775.000000 10
  164.200000 434.000000 6
  165.200000 1039.000000 14
  166.200000 262.000000 4
  167.150000 1395.000000 19
  168.200000 10647.000000 144
  169.200000 15820.000000 214
  170.200000 2620.000000 35
  171.250000 835.000000 11
  172.200000 9102.000000 123
  173.100000 1791.000000 24
  174.150000 1282.000000 17
  175.200000 319.000000 4
  176.200000 124.000000 2
  177.200000 105.000000 1
  178.200000 396.000000 5
  179.250000 752.000000 10
  180.150000 8191.000000 111
  181.100000 2503.000000 34
  182.100000 642.000000 9
  183.100000 279.000000 4
  184.100000 218.000000 3
  185.100000 137.000000 2
  186.100000 215.000000 3
  187.100000 137.000000 2
  188.100000 442.000000 6
  189.100000 258.000000 3
  190.100000 255.000000 3
  191.150000 22844.000000 309
  192.150000 4208.000000 57
  193.150000 1981.000000 27
  194.100000 3889.000000 53
  195.150000 962.000000 13
  196.150000 4571.000000 62
  197.150000 1355.000000 18
  198.100000 274.000000 4
  199.100000 222.000000 3
  200.100000 201.000000 3
  201.100000 19.000000 1
  202.100000 394.000000 5
  203.100000 89.000000 1
  204.100000 1324.000000 18
  205.100000 385.000000 5
  206.100000 414.000000 6
  207.100000 889.000000 12
  208.100000 654.000000 9
  209.100000 580.000000 8
  210.100000 169.000000 2
  211.100000 124.000000 2
  212.100000 116.000000 2
  213.100000 154.000000 2
  214.100000 105.000000 1
  215.100000 100.000000 1
  216.100000 143.000000 2
  217.100000 54.000000 1
  218.200000 1857.000000 25
  219.200000 522.000000 7
  220.200000 302.000000 4
  221.200000 225.000000 3
  222.200000 351.000000 5
  223.200000 92.000000 1
  224.200000 217.000000 3
  225.200000 177.000000 2
  226.200000 142.000000 2
  227.200000 146.000000 2
  228.200000 86.000000 1
  229.200000 38.000000 1
  230.200000 124.000000 2
  231.200000 95.000000 1
  232.200000 370.000000 5
  233.200000 210.000000 3
  234.200000 92.000000 1
  235.200000 100.000000 1
  236.200000 274.000000 4
  237.200000 287.000000 4
  238.200000 326.000000 4
  239.200000 433.000000 6
  240.200000 159.000000 2
  241.200000 121.000000 2
  242.200000 182.000000 2
  243.200000 1438.000000 19
  244.200000 393.000000 5
  245.200000 305.000000 4
  246.150000 3207.000000 43
  247.200000 854.000000 12
  248.200000 350.000000 5
  249.200000 191.000000 3
  250.200000 178.000000 2
  251.200000 138.000000 2
  252.200000 3615.000000 49
  253.200000 1058.000000 14
  254.200000 895.000000 12
  255.200000 468.000000 6
  256.200000 177.000000 2
  257.200000 158.000000 2
  258.200000 111.000000 2
  259.200000 54.000000 1
  260.200000 174.000000 2
  261.200000 178.000000 2
  262.200000 140.000000 2
  263.200000 52.000000 1
  264.200000 138.000000 2
  265.200000 127.000000 2
  266.200000 118.000000 2
  267.350000 916.000000 12
  268.250000 73827.000000 999
  269.250000 17038.000000 231
  270.200000 6609.000000 89
  271.200000 1791.000000 24
  272.200000 319.000000 4
  273.200000 194.000000 3
  274.200000 74.000000 1
  275.200000 862.000000 12
  276.200000 126.000000 2
  277.200000 215.000000 3
  278.200000 74.000000 1
  279.200000 87.000000 1
  280.200000 873.000000 12
  281.200000 324.000000 4
  282.200000 366.000000 5
  283.200000 153.000000 2
  284.200000 39.000000 1
  285.200000 106.000000 1
  286.200000 76.000000 1
  287.200000 73.000000 1
  288.200000 142.000000 2
  289.200000 422.000000 6
  290.250000 43458.000000 588
  291.250000 12216.000000 165
  292.250000 6315.000000 85
  293.200000 1340.000000 18
  294.200000 463.000000 6
  295.200000 210.000000 3
  296.200000 292.000000 4
  297.200000 178.000000 2
  298.200000 319.000000 4
  299.200000 70.000000 1
  300.200000 13.000000 1
  301.200000 30.000000 1
  302.200000 114.000000 2
  303.200000 8.000000 1
  304.200000 110.000000 1
  305.200000 24.000000 1
  306.200000 42.000000 1
  307.200000 134.000000 2
  308.200000 8.000000 1
  309.200000 50.000000 1
  310.200000 5.000000 1
  312.200000 206.000000 3
  313.200000 290.000000 4
  314.200000 111.000000 2
  315.200000 180.000000 2
  317.200000 41.000000 1
  318.200000 26.000000 1
  319.200000 38.000000 1
  320.200000 103.000000 1
  321.200000 58.000000 1
  322.200000 102.000000 1
  323.200000 58.000000 1
  326.200000 295.000000 4
  327.200000 210.000000 3
  328.200000 70.000000 1
  329.200000 473.000000 6
  330.200000 142.000000 2
  331.200000 230.000000 3
  332.200000 113.000000 2
  333.200000 63.000000 1
  334.200000 10.000000 1
  336.200000 50.000000 1
  339.200000 41.000000 1
  340.200000 116.000000 2
  341.300000 247.000000 3
  342.250000 17330.000000 235
  343.250000 5316.000000 72
  344.250000 2652.000000 36
  345.300000 591.000000 8
  346.300000 207.000000 3
  347.300000 39.000000 1
  348.300000 58.000000 1
  349.300000 68.000000 1
  350.300000 52.000000 1
  351.300000 36.000000 1
  352.300000 98.000000 1
  353.300000 30.000000 1
  354.300000 92.000000 1
  355.300000 158.000000 2
  356.300000 135.000000 2
  357.300000 249.000000 3
  358.300000 55.000000 1
  359.300000 42.000000 1
  360.300000 57.000000 1
  362.300000 116.000000 2
  364.300000 52.000000 1
  365.300000 33.000000 1
  366.300000 36.000000 1
  368.300000 68.000000 1
  369.300000 167.000000 2
  370.250000 22966.000000 311
  371.300000 6994.000000 95
  372.250000 3497.000000 47
  373.300000 1033.000000 14
  374.300000 207.000000 3
  375.300000 74.000000 1
  377.300000 167.000000 2
  378.300000 137.000000 2
  379.300000 58.000000 1
  380.300000 14.000000 1
  381.300000 84.000000 1
  382.300000 46.000000 1
  383.300000 62.000000 1
  384.300000 146.000000 2
  385.300000 556.000000 8
  386.300000 230.000000 3
  387.300000 190.000000 3
  388.300000 122.000000 2
  391.300000 52.000000 1
  392.300000 71.000000 1
  393.300000 47.000000 1
  394.300000 78.000000 1
  395.300000 36.000000 1
  396.300000 30.000000 1
  397.300000 138.000000 2
  398.300000 50.000000 1
  400.300000 116.000000 2
  401.300000 102.000000 1
  402.300000 55.000000 1
  403.300000 47.000000 1
  404.300000 5.000000 1
  405.300000 10.000000 1
  406.300000 42.000000 1
  409.300000 33.000000 1
  410.300000 105.000000 1
  412.300000 103.000000 1
  413.300000 46.000000 1
  416.300000 6.000000 1
  417.300000 63.000000 1
  418.300000 66.000000 1
  419.300000 74.000000 1
  422.300000 16.000000 1
  423.300000 10.000000 1
  425.300000 57.000000 1
  426.300000 42.000000 1
  427.300000 68.000000 1
  428.300000 5.000000 1
  429.300000 70.000000 1
  430.300000 22.000000 1
  431.300000 68.000000 1
  433.300000 108.000000 1
  434.300000 22.000000 1
  436.300000 21.000000 1
  438.300000 52.000000 1
  439.300000 105.000000 1
  440.300000 11.000000 1
  441.300000 63.000000 1
  442.300000 38.000000 1
  443.300000 11.000000 1
  444.300000 66.000000 1
  447.300000 71.000000 1
  448.300000 18.000000 1
  449.300000 27.000000 1
  450.300000 19.000000 1
  451.300000 111.000000 2
  452.300000 41.000000 1
  454.300000 16.000000 1
  455.300000 68.000000 1
  456.300000 52.000000 1
  457.300000 55.000000 1
  458.300000 58.000000 1
  459.300000 90.000000 1
  461.300000 65.000000 1
  462.300000 27.000000 1
  463.300000 52.000000 1
  465.300000 18.000000 1
  466.300000 97.000000 1
  467.300000 84.000000 1
  469.300000 65.000000 1
  470.300000 39.000000 1
  471.300000 90.000000 1
  472.300000 76.000000 1
  473.300000 41.000000 1
  475.300000 13.000000 1
  476.300000 86.000000 1
  477.300000 5.000000 1
  478.300000 95.000000 1
  479.300000 42.000000 1
  480.300000 42.000000 1
  481.300000 68.000000 1
  482.300000 153.000000 2
  483.300000 34.000000 1
  484.300000 39.000000 1
  485.300000 50.000000 1
  486.300000 13.000000 1
  489.300000 26.000000 1
  491.300000 57.000000 1
  493.300000 31.000000 1
  494.300000 33.000000 1
  496.300000 55.000000 1
  497.300000 30.000000 1
  498.300000 60.000000 1