ACCESSION: MSBNK-GL_Sciences_Inc-GLS00115
RECORD_TITLE: 4-HydroxyMandelic acid; EI-B; MS; 3 TMS; RT: 726.11 s
DATE: 2016.01.19 (Created 2012.08.03, modified 2013.07.31)
AUTHORS: Miyagawa H, Akimoto S, Yamasaki K, GL Sciences Inc.
LICENSE: CC BY-SA
COPYRIGHT: GLS
COMMENT: The chemical compound was chemically modified with N-methyl-N-trimethylsilyl-trifluoroacetamide(MSTFA) before GC-MS analysis. When it has two or more functional groups, this modification gave a mixture of the TMS derivatives having different number of TMS groups at different functional groups.

CH$NAME: 4-HydroxyMandelic acid
CH$NAME: 4-HydroxyMandelate
CH$COMPOUND_CLASS: Natural Product
CH$FORMULA: C8H8O4
CH$EXACT_MASS: 168.04226
CH$SMILES: Oc(c1)ccc(c1)[C@H](O)C(O)=O
CH$IUPAC: InChI=1S/C8H8O4/c9-6-3-1-5(2-4-6)7(10)8(11)12/h1-4,7,9-10H,(H,11,12)/t7-/m0/s1
CH$LINK: CHEBI 32802
CH$LINK: KEGG C03198
CH$LINK: PUBCHEM 6075
CH$LINK: INCHIKEY YHXHKYRQLYQUIH-ZETCQYMHSA-N

AC$INSTRUMENT: GCMS-2010 Plus, Shimadzu
AC$INSTRUMENT_TYPE: EI-B
AC$MASS_SPECTROMETRY: MS_TYPE MS
AC$MASS_SPECTROMETRY: ION_MODE POSITIVE
AC$MASS_SPECTROMETRY: GAS_PRESSURE 75 kPa
AC$MASS_SPECTROMETRY: ION_SOURCE_TEMPERATURE 200 C
AC$MASS_SPECTROMETRY: SCAN_RANGE_M/Z 85-500
AC$CHROMATOGRAPHY: COLUMN_NAME InertCap 5MS/NP 0.25 mmI.D. x 30 m, df=0.25 um
AC$CHROMATOGRAPHY: INJECTION_TEMPERATURE 230 C
AC$CHROMATOGRAPHY: OVEN_TEMPERATURE 80 C(2 min)-15 C/min - 330C
AC$CHROMATOGRAPHY: RETENTION_INDEX 1792
AC$CHROMATOGRAPHY: RETENTION_TIME 726.11
AC$CHROMATOGRAPHY: TRANSFARLINE_TEMPERATURE 250 C

MS$FOCUSED_ION: DERIVATIVE_TYPE 3 TMS
MS$DATA_PROCESSING: WHOLE GCMSsolution

PK$SPLASH: splash10-014i-0290000000-38308ac9ef66863f75d6
PK$NUM_PEAK: 382
PK$PEAK: m/z int. rel.int.
  86.100000 180.000000 1
  87.050000 1741.000000 1
  88.100000 620.000000 1
  89.050000 4596.000000 3
  90.050000 1236.000000 1
  91.050000 12465.000000 7
  92.100000 1207.000000 1
  93.100000 1036.000000 1
  94.100000 452.000000 1
  95.050000 5490.000000 3
  96.100000 799.000000 1
  97.100000 974.000000 1
  98.100000 346.000000 1
  99.100000 802.000000 1
  100.100000 185.000000 1
  101.100000 761.000000 1
  102.050000 1131.000000 1
  103.050000 5665.000000 3
  104.100000 4380.000000 3
  105.100000 7798.000000 5
  106.100000 1033.000000 1
  107.100000 1545.000000 1
  108.100000 276.000000 1
  109.050000 1160.000000 1
  110.100000 167.000000 1
  111.100000 545.000000 1
  112.100000 130.000000 1
  113.100000 719.000000 1
  114.100000 185.000000 1
  115.100000 3975.000000 2
  116.100000 1006.000000 1
  117.100000 6855.000000 4
  118.100000 1486.000000 1
  119.050000 5666.000000 3
  120.150000 994.000000 1
  121.100000 2932.000000 2
  122.100000 383.000000 1
  123.050000 1608.000000 1
  124.100000 218.000000 1
  125.100000 140.000000 1
  126.100000 236.000000 1
  127.100000 207.000000 1
  128.100000 167.000000 1
  129.100000 962.000000 1
  130.100000 532.000000 1
  131.100000 17534.000000 10
  132.150000 2781.000000 2
  133.100000 41094.000000 24
  134.100000 5762.000000 3
  135.100000 15916.000000 9
  136.100000 1945.000000 1
  137.100000 2175.000000 1
  138.100000 462.000000 1
  139.100000 201.000000 1
  140.100000 105.000000 1
  141.100000 236.000000 1
  142.100000 119.000000 1
  143.100000 612.000000 1
  144.100000 169.000000 1
  145.100000 2487.000000 1
  146.150000 1937.000000 1
  147.150000 169484.000000 100
  148.150000 26363.000000 16
  149.150000 19164.000000 11
  150.150000 3282.000000 2
  151.100000 11990.000000 7
  152.100000 1690.000000 1
  153.100000 697.000000 1
  154.100000 90.000000 1
  155.100000 204.000000 1
  156.100000 122.000000 1
  157.100000 215.000000 1
  158.100000 148.000000 1
  159.100000 850.000000 1
  160.100000 410.000000 1
  161.100000 10847.000000 6
  162.150000 2836.000000 2
  163.100000 21486.000000 13
  164.100000 3526.000000 2
  165.100000 2596.000000 2
  166.100000 514.000000 1
  167.100000 409.000000 1
  168.100000 126.000000 1
  170.100000 182.000000 1
  171.100000 143.000000 1
  172.100000 73.000000 1
  173.100000 249.000000 1
  174.100000 454.000000 1
  175.100000 1386.000000 1
  176.100000 1887.000000 1
  177.100000 16202.000000 10
  178.100000 11988.000000 7
  179.100000 21825.000000 13
  180.050000 3746.000000 2
  181.100000 2892.000000 2
  182.100000 606.000000 1
  183.100000 236.000000 1
  184.100000 97.000000 1
  185.100000 54.000000 1
  186.100000 63.000000 1
  187.100000 122.000000 1
  188.100000 106.000000 1
  189.100000 668.000000 1
  190.100000 602.000000 1
  191.100000 8665.000000 5
  192.150000 8909.000000 5
  193.100000 100438.000000 60
  194.100000 16340.000000 10
  195.050000 6654.000000 4
  196.100000 890.000000 1
  197.100000 281.000000 1
  198.100000 47.000000 1
  199.100000 52.000000 1
  201.100000 90.000000 1
  202.100000 79.000000 1
  203.100000 278.000000 1
  204.100000 508.000000 1
  205.100000 623.000000 1
  206.100000 5729.000000 3
  207.050000 5688.000000 3
  208.150000 1074.000000 1
  209.100000 4830.000000 3
  210.100000 873.000000 1
  211.100000 564.000000 1
  212.100000 174.000000 1
  213.100000 111.000000 1
  214.100000 127.000000 1
  215.100000 105.000000 1
  216.100000 98.000000 1
  217.100000 399.000000 1
  218.100000 202.000000 1
  219.100000 2422.000000 1
  220.100000 807.000000 1
  221.100000 3972.000000 2
  222.100000 1278.000000 1
  223.150000 6279.000000 4
  224.050000 1174.000000 1
  225.100000 2086.000000 1
  226.100000 482.000000 1
  227.100000 58.000000 1
  228.100000 19.000000 1
  229.100000 52.000000 1
  230.100000 70.000000 1
  231.100000 268.000000 1
  232.100000 170.000000 1
  233.100000 634.000000 1
  234.100000 406.000000 1
  235.100000 3089.000000 2
  236.100000 2794.000000 2
  237.100000 18857.000000 11
  238.100000 4695.000000 3
  239.100000 1978.000000 1
  240.100000 231.000000 1
  241.100000 81.000000 1
  242.100000 42.000000 1
  243.100000 193.000000 1
  244.100000 65.000000 1
  245.100000 86.000000 1
  246.100000 52.000000 1
  247.100000 226.000000 1
  248.100000 201.000000 1
  249.200000 1910.000000 1
  250.150000 1098.000000 1
  251.150000 29382.000000 17
  252.150000 10967.000000 7
  253.100000 6270.000000 4
  254.150000 1530.000000 1
  255.200000 506.000000 1
  256.200000 119.000000 1
  257.200000 38.000000 1
  258.200000 18.000000 1
  259.200000 52.000000 1
  260.200000 62.000000 1
  261.200000 52.000000 1
  262.200000 5.000000 1
  263.200000 354.000000 1
  264.200000 566.000000 1
  265.200000 18815.000000 11
  266.250000 18778.000000 11
  267.200000 1684858.000000 999
  268.200000 395727.000000 235
  269.200000 153452.000000 91
  270.150000 25185.000000 15
  271.150000 4543.000000 3
  272.100000 441.000000 1
  273.100000 223.000000 1
  274.100000 71.000000 1
  275.100000 29.000000 1
  276.100000 140.000000 1
  277.100000 148.000000 1
  278.100000 396.000000 1
  279.100000 316.000000 1
  280.150000 856.000000 1
  281.100000 2199.000000 1
  282.100000 670.000000 1
  283.100000 348.000000 1
  284.100000 202.000000 1
  285.100000 153.000000 1
  286.100000 66.000000 1
  287.100000 95.000000 1
  288.100000 76.000000 1
  289.100000 5.000000 1
  290.100000 60.000000 1
  291.100000 26.000000 1
  292.100000 102.000000 1
  293.100000 726.000000 1
  294.100000 300.000000 1
  295.200000 2742.000000 2
  296.150000 1393.000000 1
  297.200000 617.000000 1
  298.200000 207.000000 1
  299.200000 150.000000 1
  300.200000 2.000000 1
  301.200000 62.000000 1
  302.200000 26.000000 1
  303.200000 36.000000 1
  304.200000 60.000000 1
  305.200000 30.000000 1
  307.200000 214.000000 1
  308.200000 150.000000 1
  309.200000 73.000000 1
  310.200000 18.000000 1
  311.200000 206.000000 1
  312.200000 100.000000 1
  313.200000 270.000000 1
  314.200000 84.000000 1
  315.200000 60.000000 1
  316.200000 89.000000 1
  317.200000 76.000000 1
  318.200000 90.000000 1
  320.200000 73.000000 1
  322.200000 18.000000 1
  323.200000 121.000000 1
  324.200000 39.000000 1
  325.200000 396.000000 1
  326.200000 119.000000 1
  327.200000 73.000000 1
  328.200000 46.000000 1
  329.200000 52.000000 1
  330.200000 66.000000 1
  331.200000 94.000000 1
  336.200000 50.000000 1
  337.200000 13.000000 1
  338.200000 73.000000 1
  339.200000 1458.000000 1
  340.250000 1603.000000 1
  341.200000 135026.000000 80
  342.200000 44948.000000 27
  343.200000 20954.000000 12
  344.150000 4082.000000 2
  345.150000 1484.000000 1
  346.100000 290.000000 1
  347.100000 166.000000 1
  349.100000 54.000000 1
  350.100000 19.000000 1
  351.100000 153.000000 1
  352.100000 62.000000 1
  353.100000 156.000000 1
  354.100000 34.000000 1
  355.100000 369.000000 1
  356.100000 284.000000 1
  357.100000 87.000000 1
  358.100000 33.000000 1
  359.100000 8.000000 1
  360.100000 2.000000 1
  361.100000 49.000000 1
  363.100000 16.000000 1
  364.100000 52.000000 1
  366.100000 113.000000 1
  367.100000 90.000000 1
  368.200000 212.000000 1
  369.200000 28457.000000 17
  370.200000 9558.000000 6
  371.200000 4206.000000 2
  372.150000 1284.000000 1
  373.200000 303.000000 1
  374.200000 218.000000 1
  375.200000 10.000000 1
  376.200000 126.000000 1
  377.200000 70.000000 1
  378.200000 86.000000 1
  379.200000 100.000000 1
  380.200000 60.000000 1
  381.200000 54.000000 1
  382.200000 33.000000 1
  383.200000 143.000000 1
  384.200000 607.000000 1
  385.200000 247.000000 1
  386.200000 129.000000 1
  387.200000 41.000000 1
  388.200000 49.000000 1
  389.200000 78.000000 1
  390.200000 14.000000 1
  391.200000 118.000000 1
  392.200000 2.000000 1
  393.200000 121.000000 1
  395.200000 49.000000 1
  396.200000 70.000000 1
  397.200000 6.000000 1
  398.200000 95.000000 1
  400.200000 10.000000 1
  401.200000 114.000000 1
  403.200000 41.000000 1
  404.200000 145.000000 1
  406.200000 34.000000 1
  407.200000 33.000000 1
  408.200000 38.000000 1
  409.200000 127.000000 1
  410.200000 78.000000 1
  411.200000 57.000000 1
  412.200000 5.000000 1
  413.200000 38.000000 1
  415.200000 33.000000 1
  416.200000 63.000000 1
  417.200000 110.000000 1
  418.200000 8.000000 1
  419.200000 55.000000 1
  420.200000 2.000000 1
  421.200000 54.000000 1
  422.200000 57.000000 1
  424.200000 13.000000 1
  425.200000 38.000000 1
  426.200000 62.000000 1
  428.200000 27.000000 1
  429.200000 31.000000 1
  430.200000 113.000000 1
  431.200000 65.000000 1
  432.200000 87.000000 1
  433.200000 10.000000 1
  434.200000 27.000000 1
  435.200000 30.000000 1
  436.200000 26.000000 1
  437.200000 38.000000 1
  438.200000 24.000000 1
  439.200000 38.000000 1
  440.200000 38.000000 1
  442.200000 50.000000 1
  443.200000 2.000000 1
  444.200000 11.000000 1
  446.200000 98.000000 1
  449.200000 60.000000 1
  450.200000 2.000000 1
  452.200000 50.000000 1
  454.200000 76.000000 1
  456.200000 95.000000 1
  457.200000 42.000000 1
  459.200000 65.000000 1
  460.200000 8.000000 1
  461.200000 74.000000 1
  462.200000 58.000000 1
  464.200000 55.000000 1
  465.200000 73.000000 1
  466.200000 26.000000 1
  468.200000 65.000000 1
  469.200000 29.000000 1
  470.200000 27.000000 1
  471.200000 8.000000 1
  472.200000 30.000000 1
  473.200000 13.000000 1
  474.200000 58.000000 1
  475.200000 97.000000 1
  476.200000 68.000000 1
  477.200000 22.000000 1
  478.200000 13.000000 1
  479.200000 97.000000 1
  480.200000 94.000000 1
  481.200000 5.000000 1
  483.200000 47.000000 1
  484.200000 30.000000 1
  485.200000 63.000000 1
  487.200000 97.000000 1
  488.200000 11.000000 1
  489.200000 79.000000 1
  491.200000 19.000000 1
  492.200000 41.000000 1
  493.200000 11.000000 1
  494.200000 13.000000 1
  495.200000 38.000000 1
  496.200000 30.000000 1
  497.200000 34.000000 1
  498.200000 21.000000 1
  499.200000 34.000000 1