ACCESSION: MSBNK-GL_Sciences_Inc-GLS00117
RECORD_TITLE: Cystamine; EI-B; MS; n TMS; RT: 910.38 s
DATE: 2016.01.19 (Created 2012.08.03, modified 2013.07.31)
AUTHORS: Miyagawa H, Akimoto S, Yamasaki K, GL Sciences Inc.
LICENSE: CC BY-SA
COPYRIGHT: GLS
COMMENT: The chemical compound was chemically modified with N-methyl-N-trimethylsilyl-trifluoroacetamide(MSTFA) before GC-MS analysis. When it has two or more functional groups, this modification gave a mixture of the TMS derivatives having different number of TMS groups at different functional groups.

CH$NAME: Cystamine
CH$COMPOUND_CLASS: Natural Product
CH$FORMULA: C4H12N2S2
CH$EXACT_MASS: 152.04419
CH$SMILES: NCCSSCCN
CH$IUPAC: InChI=1S/C4H12N2S2/c5-1-3-7-8-4-2-6/h1-6H2
CH$LINK: CAS 51-85-4
CH$LINK: CHEBI 193843
CH$LINK: INCHIKEY APQPRKLAWCIJEK-UHFFFAOYSA-N
CH$LINK: COMPTOX DTXSID60199005

AC$INSTRUMENT: GCMS-2010 Plus, Shimadzu
AC$INSTRUMENT_TYPE: EI-B
AC$MASS_SPECTROMETRY: MS_TYPE MS
AC$MASS_SPECTROMETRY: ION_MODE POSITIVE
AC$MASS_SPECTROMETRY: GAS_PRESSURE 75 kPa
AC$MASS_SPECTROMETRY: ION_SOURCE_TEMPERATURE 200 C
AC$MASS_SPECTROMETRY: SCAN_RANGE_M/Z 85-500
AC$CHROMATOGRAPHY: COLUMN_NAME InertCap 5MS/NP 0.25 mmI.D. x 30 m, df=0.25 um
AC$CHROMATOGRAPHY: INJECTION_TEMPERATURE 230 C
AC$CHROMATOGRAPHY: OVEN_TEMPERATURE 80 C(2 min)-15 C/min - 330C
AC$CHROMATOGRAPHY: RETENTION_INDEX 910.38
AC$CHROMATOGRAPHY: RETENTION_TIME 2238.44
AC$CHROMATOGRAPHY: TRANSFARLINE_TEMPERATURE 250 C

MS$FOCUSED_ION: DERIVATIVE_TYPE n TMS
MS$DATA_PROCESSING: WHOLE GCMSsolution

PK$SPLASH: splash10-00di-0900000000-5906a2cb99d59d5ae980
PK$NUM_PEAK: 364
PK$PEAK: m/z int. rel.int.
  86.100000 137358.000000 121
  87.100000 13350.000000 12
  88.050000 5838.000000 5
  88.950000 1656.000000 1
  90.100000 796.000000 1
  91.050000 4569.000000 4
  92.100000 535.000000 1
  93.100000 399.000000 1
  94.100000 146.000000 1
  95.100000 282.000000 1
  96.100000 254.000000 1
  97.100000 223.000000 1
  98.050000 1994.000000 2
  99.150000 1802.000000 2
  100.100000 137358.000000 121
  101.100000 16754.000000 15
  102.100000 9679.000000 9
  103.100000 1439.000000 1
  104.100000 836.000000 1
  105.100000 7662.000000 7
  106.100000 818.000000 1
  107.100000 666.000000 1
  108.100000 215.000000 1
  109.100000 164.000000 1
  110.100000 122.000000 1
  111.100000 263.000000 1
  112.100000 505.000000 1
  113.100000 2958.000000 3
  114.100000 13862.000000 12
  115.100000 4617.000000 4
  116.100000 17946.000000 16
  117.100000 6946.000000 6
  118.100000 4734.000000 4
  119.100000 1698.000000 1
  120.100000 561.000000 1
  121.100000 142.000000 1
  122.100000 81.000000 1
  123.100000 49.000000 1
  124.100000 44.000000 1
  125.100000 100.000000 1
  126.100000 134.000000 1
  127.100000 158.000000 1
  128.100000 831.000000 1
  129.150000 2066.000000 2
  130.100000 38270.000000 34
  131.100000 10546.000000 9
  132.100000 18713.000000 17
  133.100000 3052.000000 3
  134.150000 1487.000000 1
  135.100000 378.000000 1
  136.100000 81.000000 1
  137.100000 191.000000 1
  138.100000 114.000000 1
  139.100000 21.000000 1
  140.100000 58.000000 1
  141.100000 62.000000 1
  142.100000 354.000000 1
  143.100000 338.000000 1
  144.150000 2256.000000 2
  145.150000 800.000000 1
  146.150000 10788.000000 10
  147.150000 3259.000000 3
  148.100000 4434.000000 4
  149.150000 2254.000000 2
  150.200000 884.000000 1
  151.200000 545.000000 1
  152.200000 132.000000 1
  153.200000 76.000000 1
  154.200000 134.000000 1
  155.200000 122.000000 1
  156.200000 372.000000 1
  157.200000 370.000000 1
  158.200000 4838.000000 4
  159.200000 991.000000 1
  160.200000 1121.000000 1
  161.200000 286.000000 1
  162.200000 274.000000 1
  163.200000 638.000000 1
  164.200000 446.000000 1
  165.200000 137.000000 1
  166.200000 106.000000 1
  167.200000 82.000000 1
  168.200000 29.000000 1
  169.200000 62.000000 1
  170.200000 334.000000 1
  171.200000 129.000000 1
  172.150000 20374.000000 18
  173.250000 9519.000000 8
  174.200000 1132572.000000 999
  175.200000 193825.000000 171
  176.150000 87503.000000 77
  177.200000 10962.000000 10
  178.150000 1995.000000 2
  179.100000 239.000000 1
  181.100000 161.000000 1
  182.100000 84.000000 1
  183.100000 188.000000 1
  184.100000 100.000000 1
  185.100000 121.000000 1
  186.100000 606.000000 1
  187.250000 1313.000000 1
  188.150000 78724.000000 69
  189.150000 14891.000000 13
  190.100000 21369.000000 19
  191.150000 4013.000000 4
  192.100000 2873.000000 3
  193.100000 482.000000 1
  194.100000 289.000000 1
  195.100000 39.000000 1
  196.100000 6.000000 1
  197.100000 103.000000 1
  198.100000 62.000000 1
  199.100000 73.000000 1
  200.100000 90.000000 1
  201.100000 46.000000 1
  202.100000 140.000000 1
  203.100000 313.000000 1
  204.100000 3231.000000 3
  205.150000 1320.000000 1
  206.100000 1055.000000 1
  207.050000 1118.000000 1
  208.100000 300.000000 1
  209.100000 188.000000 1
  210.100000 26.000000 1
  211.100000 27.000000 1
  212.100000 150.000000 1
  214.100000 98.000000 1
  215.100000 2.000000 1
  217.100000 116.000000 1
  218.100000 1134.000000 1
  219.150000 1628.000000 1
  220.150000 122517.000000 108
  221.150000 23895.000000 21
  222.150000 15028.000000 13
  223.150000 2879.000000 3
  224.100000 638.000000 1
  225.100000 167.000000 1
  226.100000 81.000000 1
  227.100000 39.000000 1
  228.100000 8.000000 1
  229.100000 95.000000 1
  230.100000 110.000000 1
  231.100000 13.000000 1
  232.100000 33.000000 1
  233.100000 52.000000 1
  234.100000 97.000000 1
  235.100000 42.000000 1
  236.100000 39.000000 1
  237.100000 129.000000 1
  239.100000 27.000000 1
  240.100000 100.000000 1
  241.100000 49.000000 1
  242.100000 94.000000 1
  244.100000 90.000000 1
  246.100000 46.000000 1
  248.100000 44.000000 1
  249.100000 214.000000 1
  250.100000 108.000000 1
  251.100000 6.000000 1
  252.100000 111.000000 1
  253.100000 188.000000 1
  254.100000 6.000000 1
  257.100000 11.000000 1
  258.100000 73.000000 1
  259.100000 66.000000 1
  260.100000 11.000000 1
  261.100000 11.000000 1
  262.100000 41.000000 1
  263.100000 66.000000 1
  264.100000 167.000000 1
  265.100000 137.000000 1
  266.100000 3.000000 1
  267.100000 92.000000 1
  268.100000 57.000000 1
  270.100000 26.000000 1
  271.100000 134.000000 1
  272.100000 41.000000 1
  273.100000 42.000000 1
  274.100000 55.000000 1
  275.100000 6.000000 1
  277.100000 30.000000 1
  278.100000 78.000000 1
  280.100000 140.000000 1
  281.100000 318.000000 1
  283.100000 116.000000 1
  285.100000 44.000000 1
  286.100000 70.000000 1
  287.100000 106.000000 1
  289.100000 100.000000 1
  290.100000 47.000000 1
  292.100000 18.000000 1
  293.100000 30.000000 1
  295.100000 24.000000 1
  297.100000 73.000000 1
  298.100000 57.000000 1
  300.100000 46.000000 1
  301.100000 16.000000 1
  302.100000 113.000000 1
  303.100000 27.000000 1
  305.100000 111.000000 1
  306.100000 16.000000 1
  308.100000 10.000000 1
  309.100000 27.000000 1
  310.100000 94.000000 1
  311.100000 33.000000 1
  313.100000 47.000000 1
  314.100000 58.000000 1
  315.100000 169.000000 1
  316.100000 54.000000 1
  317.100000 116.000000 1
  319.100000 22.000000 1
  320.100000 39.000000 1
  321.100000 50.000000 1
  322.100000 55.000000 1
  323.100000 70.000000 1
  324.100000 54.000000 1
  325.100000 38.000000 1
  326.100000 89.000000 1
  327.100000 220.000000 1
  328.100000 18.000000 1
  329.100000 14.000000 1
  330.100000 111.000000 1
  331.100000 97.000000 1
  332.100000 134.000000 1
  334.100000 49.000000 1
  335.100000 50.000000 1
  336.100000 127.000000 1
  337.100000 38.000000 1
  339.100000 55.000000 1
  340.100000 58.000000 1
  341.100000 159.000000 1
  342.100000 134.000000 1
  343.100000 44.000000 1
  344.100000 57.000000 1
  345.100000 14.000000 1
  346.100000 108.000000 1
  347.100000 50.000000 1
  348.100000 60.000000 1
  349.100000 39.000000 1
  350.100000 16.000000 1
  352.100000 87.000000 1
  353.100000 11.000000 1
  355.100000 84.000000 1
  356.100000 122.000000 1
  357.100000 92.000000 1
  358.100000 34.000000 1
  359.100000 60.000000 1
  360.100000 24.000000 1
  362.100000 132.000000 1
  363.100000 30.000000 1
  364.100000 29.000000 1
  365.100000 22.000000 1
  366.100000 24.000000 1
  367.100000 60.000000 1
  368.100000 102.000000 1
  369.100000 47.000000 1
  370.100000 36.000000 1
  371.100000 74.000000 1
  372.100000 70.000000 1
  374.100000 54.000000 1
  375.100000 52.000000 1
  377.100000 137.000000 1
  379.100000 42.000000 1
  380.100000 24.000000 1
  383.100000 2.000000 1
  384.100000 50.000000 1
  385.100000 63.000000 1
  386.100000 55.000000 1
  387.100000 60.000000 1
  388.100000 79.000000 1
  389.100000 57.000000 1
  390.100000 54.000000 1
  391.100000 87.000000 1
  392.100000 13.000000 1
  393.100000 33.000000 1
  394.100000 52.000000 1
  395.100000 71.000000 1
  396.100000 55.000000 1
  397.100000 105.000000 1
  400.100000 44.000000 1
  401.100000 65.000000 1
  402.100000 132.000000 1
  404.100000 10.000000 1
  405.100000 87.000000 1
  406.100000 29.000000 1
  407.100000 33.000000 1
  409.100000 127.000000 1
  410.100000 42.000000 1
  411.100000 13.000000 1
  412.100000 22.000000 1
  413.100000 30.000000 1
  414.100000 106.000000 1
  415.100000 132.000000 1
  417.100000 30.000000 1
  418.100000 30.000000 1
  419.100000 46.000000 1
  420.100000 92.000000 1
  421.100000 21.000000 1
  422.100000 55.000000 1
  424.100000 103.000000 1
  425.100000 86.000000 1
  426.100000 16.000000 1
  428.100000 24.000000 1
  429.100000 86.000000 1
  430.100000 14.000000 1
  431.100000 102.000000 1
  432.100000 6.000000 1
  433.100000 49.000000 1
  434.100000 65.000000 1
  435.100000 146.000000 1
  436.100000 39.000000 1
  437.100000 46.000000 1
  438.100000 31.000000 1
  439.100000 71.000000 1
  440.100000 284.000000 1
  441.100000 42.000000 1
  442.100000 87.000000 1
  443.100000 60.000000 1
  444.100000 87.000000 1
  445.100000 94.000000 1
  446.100000 34.000000 1
  447.100000 34.000000 1
  449.100000 46.000000 1
  451.100000 74.000000 1
  453.100000 62.000000 1
  454.100000 63.000000 1
  455.100000 100.000000 1
  456.100000 38.000000 1
  457.100000 66.000000 1
  460.100000 46.000000 1
  461.100000 71.000000 1
  462.100000 33.000000 1
  463.100000 86.000000 1
  464.100000 71.000000 1
  465.100000 114.000000 1
  466.100000 11.000000 1
  467.100000 79.000000 1
  468.100000 6.000000 1
  469.100000 11.000000 1
  470.100000 71.000000 1
  471.100000 54.000000 1
  473.100000 26.000000 1
  474.100000 58.000000 1
  475.100000 74.000000 1
  476.100000 41.000000 1
  477.100000 65.000000 1
  478.100000 31.000000 1
  480.100000 33.000000 1
  482.100000 57.000000 1
  483.100000 6.000000 1
  484.100000 66.000000 1
  485.100000 46.000000 1
  486.100000 5.000000 1
  487.100000 18.000000 1
  488.100000 58.000000 1
  489.100000 24.000000 1
  490.100000 22.000000 1
  491.100000 52.000000 1
  493.100000 27.000000 1
  494.100000 44.000000 1
  495.100000 42.000000 1
  496.100000 52.000000 1
  497.100000 47.000000 1
  498.100000 54.000000 1