ACCESSION: MSBNK-GL_Sciences_Inc-GLS00120
RECORD_TITLE: L-(+)-Lysine; EI-B; MS; 4 TMS; RT: 791.61 s
DATE: 2016.01.19 (Created 2012.08.03, modified 2013.07.31)
AUTHORS: Miyagawa H, Akimoto S, Yamasaki K, GL Sciences Inc.
LICENSE: CC BY-SA
COPYRIGHT: GLS
COMMENT: The chemical compound was chemically modified with N-methyl-N-trimethylsilyl-trifluoroacetamide(MSTFA) before GC-MS analysis. When it has two or more functional groups, this modification gave a mixture of the TMS derivatives having different number of TMS groups at different functional groups.

CH$NAME: L-(+)-Lysine
CH$COMPOUND_CLASS: Natural Product
CH$FORMULA: C6H14N2O2
CH$EXACT_MASS: 146.10553
CH$SMILES: NCCCC[C@H](N)C(O)=O
CH$IUPAC: InChI=1S/C6H14N2O2/c7-4-2-1-3-5(8)6(9)10/h5H,1-4,7-8H2,(H,9,10)/t5-/m0/s1
CH$LINK: CAS 56-87-1
CH$LINK: CHEBI 18019
CH$LINK: KEGG C00047
CH$LINK: PUBCHEM 3349
CH$LINK: INCHIKEY KDXKERNSBIXSRK-YFKPBYRVSA-N
CH$LINK: COMPTOX DTXSID6023232

AC$INSTRUMENT: GCMS-2010 Plus, Shimadzu
AC$INSTRUMENT_TYPE: EI-B
AC$MASS_SPECTROMETRY: MS_TYPE MS
AC$MASS_SPECTROMETRY: ION_MODE POSITIVE
AC$MASS_SPECTROMETRY: GAS_PRESSURE 75 kPa
AC$MASS_SPECTROMETRY: ION_SOURCE_TEMPERATURE 200 C
AC$MASS_SPECTROMETRY: SCAN_RANGE_M/Z 85-500
AC$CHROMATOGRAPHY: COLUMN_NAME InertCap 5MS/NP 0.25 mmI.D. x 30 m, df=0.25 um
AC$CHROMATOGRAPHY: INJECTION_TEMPERATURE 230 C
AC$CHROMATOGRAPHY: OVEN_TEMPERATURE 80 C(2 min)-15 C/min - 330C
AC$CHROMATOGRAPHY: RETENTION_INDEX 1941
AC$CHROMATOGRAPHY: RETENTION_TIME 791.61
AC$CHROMATOGRAPHY: TRANSFARLINE_TEMPERATURE 250 C

MS$FOCUSED_ION: DERIVATIVE_TYPE 4 TMS
MS$DATA_PROCESSING: WHOLE GCMSsolution

PK$SPLASH: splash10-0ab9-0921000000-ebb902be0f3754225b2f
PK$NUM_PEAK: 390
PK$PEAK: m/z int. rel.int.
  86.050000 120088.000000 140
  87.050000 14183.000000 17
  88.100000 59282.000000 69
  89.100000 5466.000000 6
  90.100000 4546.000000 5
  91.100000 697.000000 1
  92.100000 332.000000 1
  93.100000 393.000000 1
  94.100000 4974.000000 6
  95.100000 1230.000000 1
  96.050000 1117.000000 1
  97.100000 2561.000000 3
  98.100000 8721.000000 10
  99.150000 7975.000000 9
  100.100000 119361.000000 139
  101.100000 15780.000000 18
  102.100000 40506.000000 47
  103.050000 12372.000000 14
  104.050000 2891.000000 3
  105.100000 858.000000 1
  106.100000 361.000000 1
  107.100000 191.000000 1
  108.100000 743.000000 1
  109.100000 402.000000 1
  110.100000 2175.000000 3
  111.050000 1562.000000 2
  112.100000 34417.000000 40
  113.100000 8882.000000 10
  114.100000 34791.000000 41
  115.100000 33494.000000 39
  116.150000 14531.000000 17
  117.100000 21809.000000 25
  118.050000 4296.000000 5
  119.100000 4353.000000 5
  120.100000 783.000000 1
  121.100000 425.000000 1
  122.100000 175.000000 1
  123.150000 958.000000 1
  124.100000 3340.000000 4
  125.150000 1291.000000 2
  126.150000 15968.000000 19
  127.150000 4230.000000 5
  128.150000 227546.000000 265
  129.150000 32778.000000 38
  130.100000 48754.000000 57
  131.100000 29871.000000 35
  132.100000 19359.000000 23
  133.100000 29564.000000 34
  134.050000 5197.000000 6
  135.100000 2550.000000 3
  136.100000 841.000000 1
  137.100000 223.000000 1
  138.100000 3172.000000 4
  139.250000 2892.000000 3
  140.150000 42162.000000 49
  141.150000 7377.000000 9
  142.150000 23354.000000 27
  143.150000 6534.000000 8
  144.150000 6361.000000 7
  145.150000 2801.000000 3
  146.150000 34366.000000 40
  147.150000 115170.000000 134
  148.150000 21773.000000 25
  149.150000 10979.000000 13
  150.200000 2860.000000 3
  151.200000 15586.000000 18
  152.150000 3559.000000 4
  153.250000 1234.000000 1
  154.200000 48028.000000 56
  155.250000 27050.000000 32
  156.200000 857492.000000 999
  157.200000 119316.000000 139
  158.200000 44071.000000 51
  159.200000 6537.000000 8
  160.150000 14817.000000 17
  161.150000 4190.000000 5
  162.150000 3686.000000 4
  163.150000 1377.000000 2
  164.150000 3172.000000 4
  165.250000 927.000000 1
  166.150000 12064.000000 14
  167.150000 5964.000000 7
  168.100000 6554.000000 8
  169.150000 2763.000000 3
  170.150000 6413.000000 7
  171.150000 1856.000000 2
  172.150000 24232.000000 28
  173.250000 11056.000000 13
  174.150000 817185.000000 952
  175.150000 128707.000000 150
  176.150000 63959.000000 75
  177.150000 7431.000000 9
  178.150000 1537.000000 2
  179.200000 290.000000 1
  180.200000 546.000000 1
  181.150000 1247.000000 1
  182.150000 2474.000000 3
  183.150000 1420.000000 2
  184.150000 5239.000000 6
  185.100000 1990.000000 2
  186.100000 17202.000000 20
  187.150000 5825.000000 7
  188.100000 7730.000000 9
  189.150000 5738.000000 7
  190.150000 3250.000000 4
  191.100000 19260.000000 22
  192.100000 3194.000000 4
  193.100000 1721.000000 2
  194.100000 278.000000 1
  195.100000 204.000000 1
  196.100000 450.000000 1
  197.100000 660.000000 1
  198.150000 2740.000000 3
  199.150000 1999.000000 2
  200.150000 85686.000000 100
  201.150000 17678.000000 21
  202.150000 29857.000000 35
  203.100000 7282.000000 8
  204.050000 4604.000000 5
  205.150000 1472.000000 2
  206.100000 1199.000000 1
  207.100000 786.000000 1
  208.100000 238.000000 1
  209.100000 222.000000 1
  210.100000 346.000000 1
  211.100000 598.000000 1
  212.150000 6224.000000 7
  213.150000 7780.000000 9
  214.150000 31515.000000 37
  215.150000 15104.000000 18
  216.150000 14311.000000 17
  217.150000 9633.000000 11
  218.100000 38782.000000 45
  219.100000 14626.000000 17
  220.100000 7383.000000 9
  221.100000 3326.000000 4
  222.100000 1058.000000 1
  223.100000 422.000000 1
  224.100000 394.000000 1
  225.100000 316.000000 1
  226.200000 1554.000000 2
  227.250000 2796.000000 3
  228.200000 91486.000000 107
  229.150000 24942.000000 29
  230.150000 246409.000000 287
  231.150000 51643.000000 60
  232.150000 26586.000000 31
  233.150000 3882.000000 5
  234.150000 1273.000000 1
  235.100000 257.000000 1
  236.100000 361.000000 1
  237.100000 231.000000 1
  238.100000 514.000000 1
  239.200000 3983.000000 5
  240.200000 7932.000000 9
  241.150000 2919.000000 3
  242.200000 2190.000000 3
  243.250000 4256.000000 5
  244.150000 5629.000000 7
  245.150000 1580.000000 2
  246.150000 2522.000000 3
  247.100000 902.000000 1
  248.200000 1342.000000 2
  249.200000 358.000000 1
  250.200000 300.000000 1
  251.200000 121.000000 1
  252.200000 159.000000 1
  253.200000 567.000000 1
  254.150000 1216.000000 1
  255.200000 6761.000000 8
  256.200000 4788.000000 6
  257.200000 2276.000000 3
  258.150000 7982.000000 9
  259.200000 1950.000000 2
  260.200000 5070.000000 6
  261.150000 1167.000000 1
  262.200000 633.000000 1
  263.200000 305.000000 1
  264.200000 362.000000 1
  266.200000 122.000000 1
  267.200000 52.000000 1
  268.200000 95.000000 1
  269.200000 50.000000 1
  270.200000 222.000000 1
  271.200000 1697.000000 2
  272.200000 13337.000000 16
  273.250000 18951.000000 22
  274.200000 8748.000000 10
  275.150000 2796.000000 3
  276.200000 847.000000 1
  277.200000 300.000000 1
  278.200000 223.000000 1
  279.200000 16.000000 1
  280.200000 29.000000 1
  281.200000 84.000000 1
  282.200000 49.000000 1
  283.200000 24.000000 1
  284.200000 27.000000 1
  285.200000 230.000000 1
  286.200000 319.000000 1
  287.200000 478.000000 1
  288.200000 1042.000000 1
  289.200000 553.000000 1
  290.200000 326.000000 1
  291.200000 631.000000 1
  292.200000 487.000000 1
  293.200000 124.000000 1
  294.200000 174.000000 1
  295.200000 44.000000 1
  296.200000 76.000000 1
  297.200000 84.000000 1
  298.200000 89.000000 1
  299.200000 233.000000 1
  300.200000 302.000000 1
  301.250000 2250.000000 3
  302.250000 3766.000000 4
  303.250000 2156.000000 3
  304.200000 3767.000000 4
  305.200000 886.000000 1
  306.200000 810.000000 1
  307.200000 178.000000 1
  308.200000 38.000000 1
  309.200000 68.000000 1
  311.200000 162.000000 1
  312.200000 270.000000 1
  313.300000 1143.000000 1
  314.300000 516.000000 1
  315.300000 1150.000000 1
  316.350000 4294.000000 5
  317.300000 366369.000000 427
  318.250000 110484.000000 129
  319.250000 50802.000000 59
  320.250000 11400.000000 13
  321.150000 2491.000000 3
  322.200000 343.000000 1
  323.200000 118.000000 1
  326.200000 65.000000 1
  327.250000 1990.000000 2
  328.350000 1197.000000 1
  329.250000 39834.000000 46
  330.250000 14900.000000 17
  331.250000 7873.000000 9
  332.250000 1935.000000 2
  333.200000 625.000000 1
  334.200000 148.000000 1
  335.200000 97.000000 1
  336.200000 137.000000 1
  337.200000 118.000000 1
  338.200000 76.000000 1
  340.200000 22.000000 1
  341.200000 166.000000 1
  342.200000 63.000000 1
  343.200000 415.000000 1
  344.200000 801.000000 1
  345.200000 719.000000 1
  346.200000 367.000000 1
  347.200000 334.000000 1
  348.200000 55.000000 1
  349.200000 111.000000 1
  350.200000 3.000000 1
  351.200000 33.000000 1
  352.200000 127.000000 1
  353.200000 90.000000 1
  354.200000 41.000000 1
  355.200000 175.000000 1
  356.200000 119.000000 1
  357.200000 29.000000 1
  358.200000 100.000000 1
  359.200000 79.000000 1
  360.200000 156.000000 1
  361.200000 678.000000 1
  362.300000 1452.000000 2
  363.300000 474.000000 1
  364.300000 142.000000 1
  365.300000 30.000000 1
  366.300000 10.000000 1
  367.300000 54.000000 1
  368.300000 47.000000 1
  369.300000 74.000000 1
  370.300000 182.000000 1
  371.300000 74.000000 1
  372.300000 132.000000 1
  373.300000 57.000000 1
  374.300000 134.000000 1
  375.300000 108.000000 1
  376.300000 95.000000 1
  377.300000 81.000000 1
  379.300000 39.000000 1
  380.300000 65.000000 1
  381.300000 74.000000 1
  382.300000 119.000000 1
  383.300000 78.000000 1
  384.300000 19.000000 1
  385.300000 97.000000 1
  386.300000 118.000000 1
  388.300000 36.000000 1
  389.300000 158.000000 1
  390.300000 124.000000 1
  391.300000 6050.000000 7
  392.300000 2618.000000 3
  393.300000 1758.000000 2
  394.300000 409.000000 1
  395.300000 129.000000 1
  396.300000 27.000000 1
  397.300000 84.000000 1
  398.300000 54.000000 1
  400.300000 95.000000 1
  401.300000 121.000000 1
  402.300000 186.000000 1
  403.300000 74.000000 1
  404.300000 158.000000 1
  405.300000 119.000000 1
  406.300000 94.000000 1
  407.300000 95.000000 1
  408.300000 153.000000 1
  409.300000 30.000000 1
  411.300000 95.000000 1
  412.300000 19.000000 1
  414.300000 18.000000 1
  415.300000 60.000000 1
  416.300000 140.000000 1
  417.300000 134.000000 1
  418.300000 410.000000 1
  419.300000 13273.000000 15
  420.250000 5616.000000 7
  421.250000 2370.000000 3
  422.250000 939.000000 1
  423.200000 218.000000 1
  424.200000 82.000000 1
  425.200000 60.000000 1
  426.200000 127.000000 1
  427.200000 36.000000 1
  428.200000 79.000000 1
  429.200000 71.000000 1
  431.200000 55.000000 1
  432.200000 286.000000 1
  433.350000 1275.000000 1
  434.350000 59904.000000 70
  435.300000 25561.000000 30
  436.300000 13460.000000 16
  437.300000 3793.000000 4
  438.350000 1026.000000 1
  439.400000 134.000000 1
  440.400000 164.000000 1
  441.400000 105.000000 1
  442.400000 34.000000 1
  443.400000 74.000000 1
  445.400000 38.000000 1
  446.400000 54.000000 1
  447.400000 60.000000 1
  449.400000 62.000000 1
  450.400000 94.000000 1
  452.400000 34.000000 1
  453.400000 52.000000 1
  455.400000 46.000000 1
  456.400000 26.000000 1
  457.400000 21.000000 1
  458.400000 34.000000 1
  460.400000 36.000000 1
  461.400000 103.000000 1
  462.400000 18.000000 1
  463.400000 87.000000 1
  464.400000 81.000000 1
  465.400000 41.000000 1
  466.400000 41.000000 1
  467.400000 116.000000 1
  468.400000 38.000000 1
  469.400000 41.000000 1
  470.400000 42.000000 1
  471.400000 44.000000 1
  473.400000 76.000000 1
  476.400000 68.000000 1
  477.400000 29.000000 1
  478.400000 79.000000 1
  479.400000 10.000000 1
  480.400000 55.000000 1
  481.400000 58.000000 1
  482.400000 44.000000 1
  484.400000 58.000000 1
  485.400000 33.000000 1
  486.400000 36.000000 1
  487.400000 58.000000 1
  488.400000 13.000000 1
  490.400000 6.000000 1
  491.400000 86.000000 1
  492.400000 102.000000 1
  494.400000 44.000000 1
  495.400000 38.000000 1
  497.400000 18.000000 1
  499.400000 13.000000 1