ACCESSION: MSBNK-GL_Sciences_Inc-GLS00121
RECORD_TITLE: N-alpha-Acetyl-L-Ornithine; EI-B; MS; n TMS; RT: 816.15 s
DATE: 2016.01.19 (Created 2012.08.03, modified 2013.07.31)
AUTHORS: Miyagawa H, Akimoto S, Yamasaki K, GL Sciences Inc.
LICENSE: CC BY-SA
COPYRIGHT: GLS
COMMENT: The chemical compound was chemically modified with N-methyl-N-trimethylsilyl-trifluoroacetamide(MSTFA) before GC-MS analysis. When it has two or more functional groups, this modification gave a mixture of the TMS derivatives having different number of TMS groups at different functional groups.

CH$NAME: N-alpha-Acetyl-L-Ornithine
CH$NAME: N-a-Acetyl-L-Ornithine
CH$COMPOUND_CLASS: Natural Product
CH$FORMULA: C7H14N2O3
CH$EXACT_MASS: 174.10044
CH$SMILES: NCCC[C@H](NC(C)=O)C(O)=O
CH$IUPAC: InChI=1S/C7H14N2O3/c1-5(10)9-6(7(11)12)3-2-4-8/h6H,2-4,8H2,1H3,(H,9,10)(H,11,12)/t6-/m0/s1
CH$LINK: CAS 6205-08-9
CH$LINK: CHEBI 16543
CH$LINK: KEGG C00437
CH$LINK: PUBCHEM 3726
CH$LINK: INCHIKEY JRLGPAXAGHMNOL-LURJTMIESA-N
CH$LINK: COMPTOX DTXSID80331400

AC$INSTRUMENT: GCMS-2010 Plus, Shimadzu
AC$INSTRUMENT_TYPE: EI-B
AC$MASS_SPECTROMETRY: MS_TYPE MS
AC$MASS_SPECTROMETRY: ION_MODE POSITIVE
AC$MASS_SPECTROMETRY: GAS_PRESSURE 75 kPa
AC$MASS_SPECTROMETRY: ION_SOURCE_TEMPERATURE 200 C
AC$MASS_SPECTROMETRY: SCAN_RANGE_M/Z 85-500
AC$CHROMATOGRAPHY: COLUMN_NAME InertCap 5MS/NP 0.25 mmI.D. x 30 m, df=0.25 um
AC$CHROMATOGRAPHY: INJECTION_TEMPERATURE 230 C
AC$CHROMATOGRAPHY: OVEN_TEMPERATURE 80 C(2 min)-15 C/min - 330C
AC$CHROMATOGRAPHY: RETENTION_INDEX 1998
AC$CHROMATOGRAPHY: RETENTION_TIME 816.15
AC$CHROMATOGRAPHY: TRANSFARLINE_TEMPERATURE 250 C

MS$FOCUSED_ION: DERIVATIVE_TYPE n TMS
MS$DATA_PROCESSING: WHOLE GCMSsolution

PK$SPLASH: splash10-0fk9-0930000000-6914c12040164b5148b0
PK$NUM_PEAK: 389
PK$PEAK: m/z int. rel.int.
  86.050000 41746.000000 203
  87.100000 4956.000000 24
  88.100000 2257.000000 11
  89.100000 719.000000 3
  90.100000 254.000000 1
  91.100000 281.000000 1
  92.100000 207.000000 1
  93.100000 412.000000 2
  94.100000 4545.000000 22
  95.100000 678.000000 3
  96.050000 2408.000000 12
  97.100000 1001.000000 5
  98.100000 1978.000000 10
  99.100000 3119.000000 15
  100.100000 28086.000000 137
  101.100000 4561.000000 22
  102.100000 6172.000000 30
  103.100000 2433.000000 12
  104.100000 410.000000 2
  105.100000 662.000000 3
  106.100000 114.000000 1
  107.100000 5.000000 1
  108.100000 353.000000 2
  109.100000 418.000000 2
  110.100000 911.000000 4
  111.100000 886.000000 4
  112.100000 8521.000000 41
  113.150000 3004.000000 15
  114.150000 43088.000000 210
  115.150000 7897.000000 38
  116.150000 11584.000000 56
  117.100000 4962.000000 24
  118.100000 906.000000 4
  119.100000 1159.000000 6
  120.100000 196.000000 1
  121.100000 332.000000 2
  122.100000 108.000000 1
  123.100000 49.000000 1
  124.100000 343.000000 2
  125.100000 500.000000 2
  126.150000 2869.000000 14
  127.100000 985.000000 5
  128.150000 5073.000000 25
  129.100000 3278.000000 16
  130.100000 11977.000000 58
  131.100000 8374.000000 41
  132.150000 5334.000000 26
  133.100000 8100.000000 39
  134.100000 1134.000000 6
  135.100000 863.000000 4
  136.100000 124.000000 1
  137.100000 148.000000 1
  138.100000 354.000000 2
  139.250000 894.000000 4
  140.200000 3183.000000 15
  141.250000 1990.000000 10
  142.200000 44756.000000 218
  143.200000 7175.000000 35
  144.150000 4162.000000 20
  145.200000 918.000000 4
  146.200000 8948.000000 44
  147.150000 42579.000000 207
  148.150000 6583.000000 32
  149.150000 4942.000000 24
  150.100000 753.000000 4
  151.100000 409.000000 2
  152.200000 2730.000000 13
  153.200000 369.000000 2
  154.150000 2506.000000 12
  155.150000 1072.000000 5
  156.200000 3903.000000 19
  157.200000 6774.000000 33
  158.200000 36108.000000 176
  159.250000 4825.000000 23
  160.200000 2878.000000 14
  161.150000 1415.000000 7
  162.100000 545.000000 3
  163.100000 362.000000 2
  164.100000 148.000000 1
  165.100000 113.000000 1
  166.100000 513.000000 2
  167.200000 839.000000 4
  168.200000 4311.000000 21
  169.150000 1196.000000 6
  170.200000 7278.000000 35
  171.250000 5155.000000 25
  172.150000 67080.000000 326
  173.200000 13076.000000 64
  174.200000 205417.000000 999
  175.200000 39319.000000 191
  176.200000 17153.000000 83
  177.150000 2119.000000 10
  178.200000 497.000000 2
  179.200000 148.000000 1
  181.200000 183.000000 1
  182.200000 505.000000 2
  183.150000 1195.000000 6
  184.150000 7949.000000 39
  185.150000 10548.000000 51
  186.150000 5094.000000 25
  187.150000 32325.000000 157
  188.150000 7879.000000 38
  189.200000 4055.000000 20
  190.150000 4595.000000 22
  191.200000 1137.000000 6
  192.200000 569.000000 3
  193.200000 471.000000 2
  194.200000 308.000000 1
  195.200000 308.000000 1
  196.200000 607.000000 3
  197.100000 340.000000 2
  198.100000 2359.000000 11
  199.250000 2035.000000 10
  200.150000 175952.000000 856
  201.150000 32487.000000 158
  202.150000 15995.000000 78
  203.100000 2666.000000 13
  204.150000 2185.000000 11
  205.150000 1107.000000 5
  206.100000 361.000000 2
  207.100000 1105.000000 5
  208.100000 348.000000 2
  209.100000 250.000000 1
  210.100000 841.000000 4
  211.150000 2556.000000 12
  212.150000 3683.000000 18
  213.150000 1301.000000 6
  214.150000 3713.000000 18
  215.150000 1123.000000 5
  216.150000 5445.000000 26
  217.150000 1482.000000 7
  218.150000 1744.000000 8
  219.150000 1141.000000 6
  220.100000 591.000000 3
  221.100000 1898.000000 9
  222.100000 566.000000 3
  223.100000 180.000000 1
  224.100000 89.000000 1
  225.100000 97.000000 1
  226.150000 1664.000000 8
  227.100000 614.000000 3
  228.150000 1754.000000 9
  229.100000 674.000000 3
  230.150000 2551.000000 12
  231.200000 844.000000 4
  232.200000 730.000000 4
  233.200000 182.000000 1
  234.200000 156.000000 1
  235.200000 14.000000 1
  236.200000 18.000000 1
  237.200000 11.000000 1
  238.200000 119.000000 1
  239.200000 106.000000 1
  240.200000 452.000000 2
  241.200000 388.000000 2
  242.200000 905.000000 4
  243.200000 586.000000 3
  244.200000 2196.000000 11
  245.150000 1178.000000 6
  246.100000 726.000000 4
  247.100000 346.000000 2
  248.250000 1583.000000 8
  249.200000 423.000000 2
  250.200000 215.000000 1
  251.200000 52.000000 1
  252.200000 54.000000 1
  253.200000 209.000000 1
  254.200000 103.000000 1
  255.200000 202.000000 1
  256.200000 505.000000 2
  257.200000 351.000000 2
  258.200000 8148.000000 40
  259.150000 2055.000000 10
  260.150000 1558.000000 8
  261.150000 2900.000000 14
  262.150000 2008.000000 10
  263.200000 948.000000 5
  264.200000 537.000000 3
  265.200000 170.000000 1
  266.200000 113.000000 1
  267.200000 425.000000 2
  268.200000 228.000000 1
  269.200000 183.000000 1
  270.200000 38.000000 1
  271.200000 777.000000 4
  272.200000 551.000000 3
  273.200000 230.000000 1
  274.200000 1908.000000 9
  275.200000 3212.000000 16
  276.200000 793.000000 4
  277.200000 471.000000 2
  278.200000 191.000000 1
  279.200000 86.000000 1
  280.200000 24.000000 1
  281.200000 278.000000 1
  282.200000 361.000000 2
  283.200000 703.000000 3
  284.200000 375.000000 2
  285.250000 765.000000 4
  286.200000 8857.000000 43
  287.250000 2439.000000 12
  288.200000 6105.000000 30
  289.200000 2220.000000 11
  290.200000 998.000000 5
  291.200000 162.000000 1
  292.200000 225.000000 1
  294.200000 62.000000 1
  296.200000 58.000000 1
  298.200000 30.000000 1
  299.250000 5627.000000 27
  300.200000 3388.000000 16
  301.250000 2093.000000 10
  302.250000 8105.000000 39
  303.200000 1983.000000 10
  304.250000 1052.000000 5
  305.200000 111.000000 1
  307.200000 36.000000 1
  308.200000 31.000000 1
  309.200000 127.000000 1
  310.200000 30.000000 1
  311.200000 31.000000 1
  312.200000 65.000000 1
  313.200000 87.000000 1
  314.200000 470.000000 2
  315.200000 74.000000 1
  316.300000 822.000000 4
  317.250000 4075.000000 20
  318.250000 1369.000000 7
  319.300000 278.000000 1
  320.300000 367.000000 2
  321.300000 121.000000 1
  322.300000 156.000000 1
  323.300000 44.000000 1
  325.300000 13.000000 1
  326.300000 44.000000 1
  327.300000 113.000000 1
  328.300000 36.000000 1
  329.300000 97.000000 1
  330.250000 1075.000000 5
  331.250000 1152.000000 6
  332.200000 620.000000 3
  333.200000 986.000000 5
  334.300000 414.000000 2
  335.300000 11906.000000 58
  336.250000 3760.000000 18
  337.200000 1759.000000 9
  338.200000 596.000000 3
  339.200000 87.000000 1
  341.200000 68.000000 1
  342.200000 86.000000 1
  343.200000 118.000000 1
  344.200000 142.000000 1
  345.200000 175.000000 1
  346.200000 204.000000 1
  347.200000 38.000000 1
  348.200000 194.000000 1
  349.200000 66.000000 1
  350.200000 21.000000 1
  351.200000 18.000000 1
  352.200000 30.000000 1
  353.200000 73.000000 1
  354.200000 34.000000 1
  355.200000 295.000000 1
  356.200000 52.000000 1
  357.250000 1156.000000 6
  358.200000 686.000000 3
  359.200000 513.000000 2
  360.200000 172.000000 1
  361.200000 204.000000 1
  362.200000 100.000000 1
  363.200000 86.000000 1
  364.200000 84.000000 1
  365.200000 19.000000 1
  366.200000 73.000000 1
  367.200000 57.000000 1
  368.200000 10.000000 1
  371.200000 234.000000 1
  372.300000 1273.000000 6
  373.350000 1390.000000 7
  374.350000 819.000000 4
  375.250000 2771.000000 13
  376.300000 689.000000 3
  377.300000 406.000000 2
  378.300000 175.000000 1
  379.300000 153.000000 1
  380.300000 76.000000 1
  381.300000 41.000000 1
  382.300000 86.000000 1
  383.300000 6.000000 1
  384.300000 70.000000 1
  386.300000 11.000000 1
  387.300000 29.000000 1
  388.300000 2.000000 1
  389.300000 863.000000 4
  390.300000 1022.000000 5
  391.300000 436.000000 2
  392.300000 217.000000 1
  393.300000 39.000000 1
  395.300000 41.000000 1
  396.300000 124.000000 1
  397.300000 49.000000 1
  398.300000 47.000000 1
  400.300000 5.000000 1
  401.300000 71.000000 1
  402.300000 33.000000 1
  403.300000 170.000000 1
  404.300000 19.000000 1
  405.300000 166.000000 1
  406.300000 114.000000 1
  407.300000 39.000000 1
  408.300000 84.000000 1
  409.300000 27.000000 1
  410.300000 2.000000 1
  411.300000 124.000000 1
  412.300000 46.000000 1
  413.300000 84.000000 1
  414.300000 110.000000 1
  415.300000 82.000000 1
  416.300000 22.000000 1
  417.300000 68.000000 1
  418.300000 95.000000 1
  419.300000 127.000000 1
  420.300000 146.000000 1
  422.300000 142.000000 1
  423.300000 65.000000 1
  424.300000 86.000000 1
  427.300000 34.000000 1
  428.300000 22.000000 1
  429.300000 78.000000 1
  430.300000 52.000000 1
  431.300000 63.000000 1
  433.300000 108.000000 1
  434.300000 54.000000 1
  435.300000 71.000000 1
  437.300000 19.000000 1
  438.300000 55.000000 1
  441.300000 65.000000 1
  442.300000 94.000000 1
  443.300000 78.000000 1
  444.300000 71.000000 1
  445.300000 73.000000 1
  446.300000 151.000000 1
  447.300000 13602.000000 66
  448.250000 5658.000000 28
  449.300000 3202.000000 16
  450.300000 1010.000000 5
  451.300000 292.000000 1
  452.300000 78.000000 1
  453.300000 78.000000 1
  454.300000 18.000000 1
  455.300000 49.000000 1
  456.300000 154.000000 1
  457.300000 70.000000 1
  458.300000 65.000000 1
  460.300000 24.000000 1
  461.400000 313.000000 2
  462.350000 4497.000000 22
  463.300000 2114.000000 10
  464.350000 949.000000 5
  465.300000 286.000000 1
  466.300000 212.000000 1
  467.300000 73.000000 1
  468.300000 5.000000 1
  469.300000 24.000000 1
  470.300000 156.000000 1
  471.300000 38.000000 1
  472.300000 46.000000 1
  473.300000 33.000000 1
  474.300000 46.000000 1
  475.300000 62.000000 1
  476.300000 103.000000 1
  477.300000 103.000000 1
  478.300000 55.000000 1
  479.300000 89.000000 1
  481.300000 8.000000 1
  482.300000 60.000000 1
  483.300000 49.000000 1
  486.300000 3.000000 1
  487.300000 27.000000 1
  488.300000 145.000000 1
  489.300000 29.000000 1
  490.300000 33.000000 1
  491.300000 122.000000 1
  492.300000 50.000000 1
  493.300000 70.000000 1
  494.300000 11.000000 1
  496.300000 71.000000 1
  497.300000 95.000000 1
  498.300000 34.000000 1