ACCESSION: MSBNK-GL_Sciences_Inc-GLS00131
RECORD_TITLE: Suberic acid; EI-B; MS; 2 TMS; RT: 682.90 s
DATE: 2016.01.19 (Created 2012.08.03, modified 2013.07.31)
AUTHORS: Miyagawa H, Akimoto S, Yamasaki K, GL Sciences Inc.
LICENSE: CC BY-SA
COPYRIGHT: GLS
COMMENT: The chemical compound was chemically modified with N-methyl-N-trimethylsilyl-trifluoroacetamide(MSTFA) before GC-MS analysis. When it has two or more functional groups, this modification gave a mixture of the TMS derivatives having different number of TMS groups at different functional groups.

CH$NAME: Suberic acid
CH$NAME: Cork acid
CH$COMPOUND_CLASS: Natural Product
CH$FORMULA: C8H14O4
CH$EXACT_MASS: 174.08921
CH$SMILES: OC(=O)CCCCCCC(O)=O
CH$IUPAC: InChI=1S/C8H14O4/c9-7(10)5-3-1-2-4-6-8(11)12/h1-6H2,(H,9,10)(H,11,12)
CH$LINK: CAS 505-48-6
CH$LINK: CHEBI 9300
CH$LINK: KEGG C08278
CH$LINK: PUBCHEM 10476
CH$LINK: INCHIKEY TYFQFVWCELRYAO-UHFFFAOYSA-N
CH$LINK: COMPTOX DTXSID8021644

AC$INSTRUMENT: GCMS-2010 Plus, Shimadzu
AC$INSTRUMENT_TYPE: EI-B
AC$MASS_SPECTROMETRY: MS_TYPE MS
AC$MASS_SPECTROMETRY: ION_MODE POSITIVE
AC$MASS_SPECTROMETRY: GAS_PRESSURE 75 kPa
AC$MASS_SPECTROMETRY: ION_SOURCE_TEMPERATURE 200 C
AC$MASS_SPECTROMETRY: SCAN_RANGE_M/Z 85-500
AC$CHROMATOGRAPHY: COLUMN_NAME InertCap 5MS/NP 0.25 mmI.D. x 30 m, df=0.25 um
AC$CHROMATOGRAPHY: INJECTION_TEMPERATURE 230 C
AC$CHROMATOGRAPHY: OVEN_TEMPERATURE 80 C(2 min)-15 C/min - 330C
AC$CHROMATOGRAPHY: RETENTION_INDEX 1700
AC$CHROMATOGRAPHY: RETENTION_TIME 682.90
AC$CHROMATOGRAPHY: TRANSFARLINE_TEMPERATURE 250 C

MS$FOCUSED_ION: DERIVATIVE_TYPE 2 TMS
MS$DATA_PROCESSING: WHOLE GCMSsolution

PK$SPLASH: splash10-00kk-1910000000-e6b559f2a680d7643eff
PK$NUM_PEAK: 374
PK$PEAK: m/z int. rel.int.
  86.050000 5571.000000 64
  87.050000 2256.000000 26
  88.000000 2033.000000 24
  89.050000 4914.000000 57
  90.000000 806.000000 9
  91.050000 5190.000000 60
  92.050000 939.000000 11
  93.050000 37951.000000 439
  94.050000 3583.000000 41
  95.100000 44183.000000 511
  96.050000 4843.000000 56
  97.050000 46192.000000 534
  98.050000 3390.000000 39
  99.050000 6715.000000 78
  100.050000 952.000000 11
  101.000000 3786.000000 44
  102.000000 889.000000 10
  103.050000 5568.000000 64
  104.000000 396.000000 5
  105.000000 1223.000000 14
  106.000000 289.000000 3
  107.000000 418.000000 5
  108.100000 186.000000 2
  109.100000 22372.000000 259
  110.100000 12849.000000 149
  111.100000 17670.000000 204
  112.100000 1690.000000 20
  113.050000 2234.000000 26
  114.100000 353.000000 4
  115.050000 2280.000000 26
  116.000000 8815.000000 102
  117.050000 53631.000000 620
  118.050000 5730.000000 66
  119.050000 4214.000000 49
  120.150000 777.000000 9
  121.050000 17167.000000 198
  122.100000 1497.000000 17
  123.100000 338.000000 4
  124.100000 29.000000 1
  125.100000 604.000000 7
  126.100000 130.000000 2
  127.100000 1668.000000 19
  128.000000 606.000000 7
  129.050000 52310.000000 605
  130.050000 6980.000000 81
  131.050000 7395.000000 85
  132.050000 6052.000000 70
  133.050000 11396.000000 132
  134.050000 1806.000000 21
  135.000000 1706.000000 20
  136.000000 351.000000 4
  137.100000 3519.000000 41
  138.050000 40106.000000 464
  139.100000 53191.000000 615
  140.100000 5121.000000 59
  141.100000 2626.000000 30
  142.050000 1641.000000 19
  143.050000 6942.000000 80
  144.100000 3794.000000 44
  145.050000 7259.000000 84
  146.150000 903.000000 10
  147.050000 50080.000000 579
  148.050000 8100.000000 94
  149.050000 64619.000000 747
  150.050000 8828.000000 102
  151.050000 5802.000000 67
  152.000000 412.000000 5
  153.000000 324.000000 4
  154.000000 231.000000 3
  155.100000 4782.000000 55
  156.050000 1628.000000 19
  157.050000 3926.000000 45
  158.100000 1319.000000 15
  159.100000 1953.000000 23
  160.100000 438.000000 5
  161.100000 311.000000 4
  162.100000 596.000000 7
  163.100000 887.000000 10
  164.100000 202.000000 2
  165.100000 284.000000 3
  166.100000 134.000000 2
  167.100000 708.000000 8
  168.150000 855.000000 10
  169.100000 86422.000000 999
  170.050000 13593.000000 157
  171.050000 13700.000000 158
  172.050000 2810.000000 32
  173.050000 1837.000000 21
  174.050000 2192.000000 25
  175.000000 519.000000 6
  176.000000 207.000000 2
  177.000000 305.000000 4
  178.000000 185.000000 2
  179.000000 292.000000 3
  180.000000 66.000000 1
  181.000000 114.000000 1
  182.000000 505.000000 6
  183.000000 1134.000000 13
  184.000000 2738.000000 32
  185.000000 14618.000000 169
  186.050000 5691.000000 66
  187.050000 75565.000000 873
  188.000000 12343.000000 143
  189.000000 4986.000000 58
  190.000000 678.000000 8
  191.000000 6620.000000 77
  191.950000 1081.000000 12
  192.900000 535.000000 6
  193.900000 199.000000 2
  194.900000 425.000000 5
  195.900000 166.000000 2
  196.900000 177.000000 2
  197.900000 86.000000 1
  198.900000 708.000000 8
  200.050000 6015.000000 70
  201.050000 1556.000000 18
  202.000000 510.000000 6
  203.000000 2682.000000 31
  204.000000 23242.000000 269
  205.000000 5055.000000 58
  206.000000 2230.000000 26
  207.000000 641.000000 7
  208.000000 154.000000 2
  209.000000 121.000000 1
  210.050000 982.000000 11
  211.000000 11575.000000 134
  212.000000 1831.000000 21
  213.000000 20081.000000 232
  214.000000 3281.000000 38
  214.950000 1128.000000 13
  216.000000 247.000000 3
  217.000000 24687.000000 285
  218.000000 5804.000000 67
  219.000000 2553.000000 30
  220.000000 273.000000 3
  221.000000 73.000000 1
  222.000000 24.000000 1
  223.000000 18.000000 1
  224.000000 6.000000 1
  225.000000 145.000000 2
  226.000000 84.000000 1
  227.000000 305.000000 4
  228.000000 3606.000000 42
  229.050000 2555.000000 30
  230.000000 686.000000 8
  231.000000 2223.000000 26
  232.000000 679.000000 8
  233.000000 188.000000 2
  234.000000 63.000000 1
  235.000000 44.000000 1
  237.000000 8.000000 1
  239.000000 52.000000 1
  240.000000 110.000000 1
  241.000000 222.000000 3
  242.000000 68.000000 1
  243.000000 2518.000000 29
  244.000000 548.000000 6
  245.000000 602.000000 7
  246.000000 396.000000 5
  247.000000 106.000000 1
  248.000000 84.000000 1
  249.000000 30.000000 1
  250.000000 90.000000 1
  251.000000 18.000000 1
  252.000000 18.000000 1
  253.000000 134.000000 2
  254.000000 122.000000 1
  255.000000 156.000000 2
  257.000000 274.000000 3
  258.000000 276.000000 3
  259.000000 6066.000000 70
  260.000000 1425.000000 16
  261.000000 903.000000 10
  262.000000 242.000000 3
  263.000000 82.000000 1
  264.000000 14.000000 1
  265.000000 52.000000 1
  266.000000 92.000000 1
  267.000000 49.000000 1
  268.000000 42.000000 1
  269.000000 19.000000 1
  270.000000 102.000000 1
  271.000000 55.000000 1
  272.000000 78.000000 1
  273.000000 102.000000 1
  274.000000 212.000000 2
  275.000000 377.000000 4
  276.000000 1524.000000 18
  277.000000 350.000000 4
  278.000000 166.000000 2
  279.000000 159.000000 2
  280.000000 90.000000 1
  281.000000 94.000000 1
  282.000000 44.000000 1
  283.000000 98.000000 1
  285.000000 692.000000 8
  286.000000 140.000000 2
  287.000000 132.000000 2
  288.000000 124.000000 1
  290.000000 30.000000 1
  292.000000 76.000000 1
  293.000000 41.000000 1
  294.000000 127.000000 1
  295.000000 76.000000 1
  296.000000 42.000000 1
  297.000000 71.000000 1
  298.000000 34.000000 1
  299.000000 65.000000 1
  300.000000 167.000000 2
  301.000000 162.000000 2
  302.000000 50.000000 1
  303.050000 31541.000000 365
  304.000000 8457.000000 98
  305.000000 3529.000000 41
  306.000000 530.000000 6
  307.000000 287.000000 3
  309.000000 177.000000 2
  310.000000 94.000000 1
  311.000000 73.000000 1
  312.000000 55.000000 1
  313.000000 126.000000 1
  315.000000 150.000000 2
  316.000000 129.000000 1
  318.000000 191.000000 2
  319.000000 300.000000 3
  320.000000 89.000000 1
  321.000000 19.000000 1
  322.000000 13.000000 1
  324.000000 13.000000 1
  325.000000 207.000000 2
  326.000000 110.000000 1
  328.000000 2.000000 1
  329.000000 36.000000 1
  330.000000 2.000000 1
  331.000000 174.000000 2
  332.000000 8.000000 1
  333.000000 34.000000 1
  334.000000 50.000000 1
  335.000000 54.000000 1
  336.000000 97.000000 1
  337.000000 79.000000 1
  338.000000 6.000000 1
  339.000000 19.000000 1
  340.000000 100.000000 1
  341.000000 24.000000 1
  342.000000 39.000000 1
  344.000000 46.000000 1
  346.000000 11.000000 1
  347.000000 33.000000 1
  348.000000 21.000000 1
  349.000000 27.000000 1
  350.000000 46.000000 1
  351.000000 2.000000 1
  353.000000 68.000000 1
  354.000000 57.000000 1
  355.000000 95.000000 1
  356.000000 142.000000 2
  358.000000 74.000000 1
  359.000000 29.000000 1
  360.000000 78.000000 1
  361.000000 36.000000 1
  365.000000 142.000000 2
  366.000000 44.000000 1
  367.000000 13.000000 1
  368.000000 36.000000 1
  369.000000 22.000000 1
  370.000000 3.000000 1
  371.000000 54.000000 1
  372.000000 26.000000 1
  374.000000 71.000000 1
  375.000000 68.000000 1
  376.000000 148.000000 2
  377.000000 71.000000 1
  379.000000 89.000000 1
  380.000000 11.000000 1
  381.000000 73.000000 1
  383.000000 118.000000 1
  384.000000 118.000000 1
  385.000000 150.000000 2
  386.000000 81.000000 1
  388.000000 50.000000 1
  389.000000 24.000000 1
  390.000000 66.000000 1
  391.000000 362.000000 4
  393.000000 60.000000 1
  394.000000 71.000000 1
  395.000000 82.000000 1
  397.000000 70.000000 1
  398.000000 74.000000 1
  400.000000 44.000000 1
  401.000000 11.000000 1
  402.000000 68.000000 1
  403.000000 119.000000 1
  404.000000 74.000000 1
  405.000000 29.000000 1
  406.000000 110.000000 1
  407.000000 19.000000 1
  409.000000 26.000000 1
  412.000000 70.000000 1
  413.000000 21.000000 1
  414.000000 57.000000 1
  416.000000 134.000000 2
  418.000000 90.000000 1
  420.000000 2.000000 1
  421.000000 29.000000 1
  422.000000 84.000000 1
  423.000000 81.000000 1
  424.000000 146.000000 2
  426.000000 66.000000 1
  427.000000 60.000000 1
  428.000000 76.000000 1
  429.000000 65.000000 1
  430.000000 65.000000 1
  433.000000 114.000000 1
  434.000000 103.000000 1
  435.000000 41.000000 1
  436.000000 90.000000 1
  437.000000 36.000000 1
  438.000000 27.000000 1
  439.000000 92.000000 1
  440.000000 22.000000 1
  441.000000 30.000000 1
  443.000000 113.000000 1
  444.000000 110.000000 1
  445.000000 18.000000 1
  446.000000 87.000000 1
  447.000000 41.000000 1
  448.000000 44.000000 1
  449.000000 94.000000 1
  450.000000 41.000000 1
  451.000000 34.000000 1
  452.000000 50.000000 1
  453.000000 71.000000 1
  454.000000 57.000000 1
  455.000000 106.000000 1
  456.000000 81.000000 1
  457.000000 94.000000 1
  458.000000 95.000000 1
  459.000000 82.000000 1
  460.000000 33.000000 1
  461.000000 24.000000 1
  462.000000 126.000000 1
  463.000000 106.000000 1
  464.000000 79.000000 1
  465.000000 52.000000 1
  467.000000 52.000000 1
  468.000000 86.000000 1
  469.000000 58.000000 1
  470.000000 111.000000 1
  471.000000 47.000000 1
  472.000000 44.000000 1
  473.000000 71.000000 1
  474.000000 3.000000 1
  475.000000 66.000000 1
  476.000000 2.000000 1
  477.000000 46.000000 1
  478.000000 65.000000 1
  479.000000 38.000000 1
  480.000000 36.000000 1
  481.000000 68.000000 1
  483.000000 108.000000 1
  484.000000 126.000000 1
  485.000000 27.000000 1
  486.000000 42.000000 1
  487.000000 21.000000 1
  488.000000 68.000000 1
  489.000000 42.000000 1
  490.000000 21.000000 1
  492.000000 19.000000 1
  493.000000 92.000000 1
  495.000000 87.000000 1
  497.000000 3.000000 1
  498.000000 119.000000 1
  499.000000 130.000000 2