ACCESSION: MSBNK-GL_Sciences_Inc-GLS00132
RECORD_TITLE: Niacinamide; EI-B; MS; 1 TMS; RT: 571.66 s
DATE: 2016.01.19 (Created 2012.08.03, modified 2013.07.31)
AUTHORS: Miyagawa H, Akimoto S, Yamasaki K, GL Sciences Inc.
LICENSE: CC BY-SA
COPYRIGHT: GLS
COMMENT: The chemical compound was chemically modified with N-methyl-N-trimethylsilyl-trifluoroacetamide(MSTFA) before GC-MS analysis. When it has two or more functional groups, this modification gave a mixture of the TMS derivatives having different number of TMS groups at different functional groups.

CH$NAME: Niacinamide
CH$NAME: Nicotinamide
CH$COMPOUND_CLASS: Natural Product
CH$FORMULA: C6H6N2O
CH$EXACT_MASS: 122.04801
CH$SMILES: NC(=O)c(c1)cncc1
CH$IUPAC: InChI=1S/C6H6N2O/c7-6(9)5-2-1-3-8-4-5/h1-4H,(H2,7,9)
CH$LINK: CAS 98-92-0
CH$LINK: CHEBI 17154
CH$LINK: KEGG C00153
CH$LINK: PUBCHEM 3453
CH$LINK: INCHIKEY DFPAKSUCGFBDDF-UHFFFAOYSA-N
CH$LINK: COMPTOX DTXSID2020929

AC$INSTRUMENT: GCMS-2010 Plus, Shimadzu
AC$INSTRUMENT_TYPE: EI-B
AC$MASS_SPECTROMETRY: MS_TYPE MS
AC$MASS_SPECTROMETRY: ION_MODE POSITIVE
AC$MASS_SPECTROMETRY: GAS_PRESSURE 75 kPa
AC$MASS_SPECTROMETRY: ION_SOURCE_TEMPERATURE 200 C
AC$MASS_SPECTROMETRY: SCAN_RANGE_M/Z 85-500
AC$CHROMATOGRAPHY: COLUMN_NAME InertCap 5MS/NP 0.25 mmI.D. x 30 m, df=0.25 um
AC$CHROMATOGRAPHY: INJECTION_TEMPERATURE 230 C
AC$CHROMATOGRAPHY: OVEN_TEMPERATURE 80 C(2 min)-15 C/min - 330C
AC$CHROMATOGRAPHY: RETENTION_INDEX 1484
AC$CHROMATOGRAPHY: RETENTION_TIME 571.66
AC$CHROMATOGRAPHY: TRANSFARLINE_TEMPERATURE 250 C

MS$FOCUSED_ION: DERIVATIVE_TYPE 1 TMS
MS$DATA_PROCESSING: WHOLE GCMSsolution

PK$SPLASH: splash10-004i-0900000000-0e84a60cc2a2d44704f4
PK$NUM_PEAK: 364
PK$PEAK: m/z int. rel.int.
  86.000000 1666.000000 7
  87.000000 340.000000 1
  88.000000 119.000000 1
  89.500000 10978.000000 47
  90.450000 892.000000 4
  92.000000 1266.000000 5
  93.050000 3193.000000 14
  94.000000 2886.000000 12
  95.000000 833.000000 4
  96.000000 396.000000 2
  97.000000 423.000000 2
  98.000000 313.000000 1
  99.000000 260.000000 1
  100.000000 5290.000000 23
  101.000000 657.000000 3
  102.000000 575.000000 2
  103.000000 487.000000 2
  104.050000 6236.000000 27
  105.050000 19980.000000 85
  106.050000 8331.000000 36
  107.000000 1050.000000 4
  108.000000 983.000000 4
  109.000000 1044.000000 4
  110.000000 857.000000 4
  111.000000 273.000000 1
  112.000000 212.000000 1
  113.000000 206.000000 1
  114.000000 33.000000 1
  116.000000 294.000000 1
  117.000000 162.000000 1
  118.000000 346.000000 1
  119.050000 2146.000000 9
  120.050000 2534.000000 11
  121.000000 908.000000 4
  122.050000 5132.000000 22
  123.000000 551.000000 2
  124.000000 122.000000 1
  125.000000 145.000000 1
  126.000000 145.000000 1
  127.000000 143.000000 1
  128.000000 154.000000 1
  129.000000 100.000000 1
  130.000000 30.000000 1
  131.000000 530.000000 2
  132.000000 455.000000 2
  133.000000 354.000000 2
  134.000000 926.000000 4
  135.050000 1861.000000 8
  136.050000 76403.000000 327
  137.100000 10039.000000 43
  138.050000 3693.000000 16
  139.000000 220.000000 1
  140.000000 3.000000 1
  141.000000 14.000000 1
  142.000000 8.000000 1
  143.000000 65.000000 1
  144.000000 129.000000 1
  146.000000 206.000000 1
  147.000000 462.000000 2
  148.000000 353.000000 2
  149.050000 1225.000000 5
  150.050000 1875.000000 8
  151.100000 1682.000000 7
  152.100000 466.000000 2
  153.100000 47.000000 1
  154.100000 39.000000 1
  155.100000 98.000000 1
  156.100000 62.000000 1
  157.100000 74.000000 1
  158.100000 5.000000 1
  159.100000 150.000000 1
  160.100000 31.000000 1
  161.100000 914.000000 4
  162.000000 329.000000 1
  163.000000 2727.000000 12
  164.000000 466.000000 2
  165.050000 1679.000000 7
  166.100000 574.000000 2
  167.100000 252.000000 1
  168.100000 81.000000 1
  169.100000 33.000000 1
  170.100000 42.000000 1
  171.100000 132.000000 1
  172.100000 36.000000 1
  173.100000 10.000000 1
  174.100000 58.000000 1
  175.000000 1911.000000 8
  176.000000 418.000000 2
  177.000000 638.000000 3
  178.050000 1167.000000 5
  179.000000 233650.000000 999
  180.000000 33206.000000 142
  181.000000 9468.000000 40
  182.000000 943.000000 4
  183.000000 145.000000 1
  184.000000 63.000000 1
  185.000000 137.000000 1
  186.000000 3.000000 1
  187.000000 5.000000 1
  188.000000 3.000000 1
  189.000000 19.000000 1
  190.000000 70.000000 1
  192.000000 81.000000 1
  193.000000 16414.000000 70
  193.950000 9223.000000 39
  195.000000 1695.000000 7
  196.000000 318.000000 1
  197.000000 94.000000 1
  198.000000 6.000000 1
  200.000000 30.000000 1
  201.000000 14.000000 1
  202.000000 65.000000 1
  203.000000 55.000000 1
  204.000000 14.000000 1
  205.000000 132.000000 1
  206.000000 8.000000 1
  207.000000 135.000000 1
  208.000000 57.000000 1
  209.000000 62.000000 1
  210.000000 89.000000 1
  211.000000 124.000000 1
  213.000000 86.000000 1
  215.000000 98.000000 1
  216.000000 58.000000 1
  217.000000 10.000000 1
  218.000000 33.000000 1
  219.000000 191.000000 1
  220.000000 84.000000 1
  223.000000 6.000000 1
  224.000000 24.000000 1
  225.000000 34.000000 1
  226.000000 44.000000 1
  228.000000 29.000000 1
  229.000000 84.000000 1
  230.000000 34.000000 1
  231.000000 10.000000 1
  232.000000 78.000000 1
  233.000000 94.000000 1
  234.000000 6.000000 1
  235.000000 26.000000 1
  236.000000 71.000000 1
  237.000000 29.000000 1
  238.000000 84.000000 1
  240.000000 50.000000 1
  241.000000 19.000000 1
  242.000000 19.000000 1
  243.000000 33.000000 1
  245.000000 60.000000 1
  246.000000 46.000000 1
  247.000000 26.000000 1
  248.000000 63.000000 1
  249.000000 21.000000 1
  251.000000 177.000000 1
  252.000000 30.000000 1
  253.000000 239.000000 1
  255.000000 76.000000 1
  256.000000 41.000000 1
  257.000000 19.000000 1
  258.000000 81.000000 1
  259.000000 52.000000 1
  260.000000 27.000000 1
  261.000000 52.000000 1
  262.000000 16.000000 1
  263.000000 16.000000 1
  264.000000 119.000000 1
  265.000000 90.000000 1
  266.000000 55.000000 1
  267.000000 124.000000 1
  268.000000 36.000000 1
  269.000000 94.000000 1
  270.000000 118.000000 1
  271.000000 60.000000 1
  272.000000 31.000000 1
  274.000000 55.000000 1
  276.000000 13.000000 1
  277.000000 46.000000 1
  278.000000 87.000000 1
  279.000000 2.000000 1
  280.000000 29.000000 1
  281.000000 94.000000 1
  282.000000 106.000000 1
  283.000000 63.000000 1
  284.000000 29.000000 1
  286.000000 71.000000 1
  287.000000 31.000000 1
  288.000000 47.000000 1
  291.000000 94.000000 1
  293.000000 58.000000 1
  294.000000 41.000000 1
  295.000000 18.000000 1
  296.000000 2.000000 1
  297.000000 18.000000 1
  298.000000 46.000000 1
  299.000000 50.000000 1
  301.000000 92.000000 1
  302.000000 79.000000 1
  303.000000 11.000000 1
  304.000000 138.000000 1
  305.000000 41.000000 1
  306.000000 38.000000 1
  307.000000 151.000000 1
  308.000000 14.000000 1
  309.000000 116.000000 1
  310.000000 74.000000 1
  311.000000 111.000000 1
  312.000000 86.000000 1
  313.000000 105.000000 1
  314.000000 49.000000 1
  315.000000 34.000000 1
  316.000000 110.000000 1
  317.000000 38.000000 1
  318.000000 114.000000 1
  319.000000 36.000000 1
  320.000000 70.000000 1
  321.000000 6.000000 1
  322.000000 73.000000 1
  325.000000 58.000000 1
  326.000000 90.000000 1
  327.000000 124.000000 1
  328.000000 54.000000 1
  329.000000 68.000000 1
  330.000000 24.000000 1
  331.000000 73.000000 1
  332.000000 8.000000 1
  333.000000 58.000000 1
  338.000000 39.000000 1
  339.000000 39.000000 1
  340.000000 6.000000 1
  341.000000 94.000000 1
  343.000000 5.000000 1
  344.000000 50.000000 1
  345.000000 87.000000 1
  346.000000 177.000000 1
  347.000000 68.000000 1
  348.000000 87.000000 1
  349.000000 33.000000 1
  351.000000 103.000000 1
  352.000000 44.000000 1
  353.000000 52.000000 1
  355.000000 21.000000 1
  356.000000 46.000000 1
  358.000000 63.000000 1
  359.000000 34.000000 1
  360.000000 70.000000 1
  361.000000 73.000000 1
  362.000000 106.000000 1
  363.000000 38.000000 1
  365.000000 34.000000 1
  366.000000 55.000000 1
  367.000000 5.000000 1
  368.000000 81.000000 1
  369.000000 70.000000 1
  370.000000 38.000000 1
  371.000000 111.000000 1
  372.000000 33.000000 1
  373.000000 110.000000 1
  375.000000 24.000000 1
  376.000000 42.000000 1
  377.000000 29.000000 1
  378.000000 63.000000 1
  379.000000 13.000000 1
  380.000000 106.000000 1
  381.000000 66.000000 1
  382.000000 14.000000 1
  384.000000 74.000000 1
  385.000000 54.000000 1
  386.000000 10.000000 1
  387.000000 57.000000 1
  388.000000 39.000000 1
  389.000000 111.000000 1
  390.000000 94.000000 1
  391.000000 52.000000 1
  392.000000 31.000000 1
  393.000000 41.000000 1
  394.000000 3.000000 1
  395.000000 98.000000 1
  396.000000 8.000000 1
  397.000000 11.000000 1
  400.000000 14.000000 1
  402.000000 94.000000 1
  403.000000 63.000000 1
  404.000000 92.000000 1
  405.000000 39.000000 1
  406.000000 13.000000 1
  407.000000 95.000000 1
  408.000000 78.000000 1
  409.000000 52.000000 1
  410.000000 82.000000 1
  411.000000 114.000000 1
  412.000000 41.000000 1
  413.000000 70.000000 1
  414.000000 100.000000 1
  415.000000 148.000000 1
  416.000000 97.000000 1
  417.000000 50.000000 1
  418.000000 6.000000 1
  419.000000 14.000000 1
  420.000000 68.000000 1
  421.000000 3.000000 1
  422.000000 34.000000 1
  423.000000 6.000000 1
  424.000000 16.000000 1
  425.000000 132.000000 1
  426.000000 58.000000 1
  429.000000 58.000000 1
  430.000000 26.000000 1
  431.000000 44.000000 1
  432.000000 30.000000 1
  434.000000 57.000000 1
  435.000000 30.000000 1
  436.000000 22.000000 1
  437.000000 49.000000 1
  438.000000 24.000000 1
  442.000000 58.000000 1
  443.000000 16.000000 1
  444.000000 108.000000 1
  445.000000 70.000000 1
  446.000000 29.000000 1
  447.000000 76.000000 1
  448.000000 3.000000 1
  449.000000 47.000000 1
  450.000000 3.000000 1
  451.000000 89.000000 1
  452.000000 82.000000 1
  455.000000 21.000000 1
  456.000000 42.000000 1
  457.000000 65.000000 1
  458.000000 31.000000 1
  459.000000 68.000000 1
  460.000000 2.000000 1
  462.000000 54.000000 1
  463.000000 54.000000 1
  464.000000 39.000000 1
  465.000000 41.000000 1
  466.000000 5.000000 1
  467.000000 42.000000 1
  468.000000 50.000000 1
  469.000000 82.000000 1
  470.000000 111.000000 1
  471.000000 44.000000 1
  472.000000 60.000000 1
  473.000000 154.000000 1
  474.000000 73.000000 1
  475.000000 39.000000 1
  476.000000 38.000000 1
  477.000000 58.000000 1
  478.000000 19.000000 1
  479.000000 10.000000 1
  480.000000 50.000000 1
  482.000000 36.000000 1
  483.000000 57.000000 1
  484.000000 81.000000 1
  485.000000 42.000000 1
  486.000000 22.000000 1
  487.000000 78.000000 1
  488.000000 55.000000 1
  489.000000 11.000000 1
  490.000000 79.000000 1
  492.000000 27.000000 1
  495.000000 54.000000 1
  496.000000 42.000000 1
  497.000000 29.000000 1
  498.000000 103.000000 1
  499.000000 31.000000 1