ACCESSION: MSBNK-GL_Sciences_Inc-GLS00135
RECORD_TITLE: Paeonol; EI-B; MS; n TMS; RT: 664.97 s
DATE: 2016.01.19 (Created 2012.08.03, modified 2013.07.31)
AUTHORS: Miyagawa H, Akimoto S, Yamasaki K, GL Sciences Inc.
LICENSE: CC BY-SA
COPYRIGHT: GLS
COMMENT: The chemical compound was chemically modified with N-methyl-N-trimethylsilyl-trifluoroacetamide(MSTFA) before GC-MS analysis. When it has two or more functional groups, this modification gave a mixture of the TMS derivatives having different number of TMS groups at different functional groups.

CH$NAME: Paeonol
CH$COMPOUND_CLASS: Natural Product
CH$FORMULA: C9H10O3
CH$EXACT_MASS: 166.06299
CH$SMILES: COc(c1)cc(O)c(c1)C(C)=O
CH$IUPAC: InChI=1S/C9H10O3/c1-6(10)8-4-3-7(12-2)5-9(8)11/h3-5,11H,1-2H3
CH$LINK: CAS 552-41-0
CH$LINK: KEGG C10712
CH$LINK: PUBCHEM 12895
CH$LINK: INCHIKEY UILPJVPSNHJFIK-UHFFFAOYSA-N
CH$LINK: COMPTOX DTXSID1022059

AC$INSTRUMENT: GCMS-2010 Plus, Shimadzu
AC$INSTRUMENT_TYPE: EI-B
AC$MASS_SPECTROMETRY: MS_TYPE MS
AC$MASS_SPECTROMETRY: ION_MODE POSITIVE
AC$MASS_SPECTROMETRY: GAS_PRESSURE 75 kPa
AC$MASS_SPECTROMETRY: ION_SOURCE_TEMPERATURE 200 C
AC$MASS_SPECTROMETRY: SCAN_RANGE_M/Z 85-500
AC$CHROMATOGRAPHY: COLUMN_NAME InertCap 5MS/NP 0.25 mmI.D. x 30 m, df=0.25 um
AC$CHROMATOGRAPHY: INJECTION_TEMPERATURE 230 C
AC$CHROMATOGRAPHY: OVEN_TEMPERATURE 80 C(2 min)-15 C/min - 330C
AC$CHROMATOGRAPHY: RETENTION_INDEX 1664
AC$CHROMATOGRAPHY: RETENTION_TIME 664.97
AC$CHROMATOGRAPHY: TRANSFARLINE_TEMPERATURE 250 C

MS$FOCUSED_ION: DERIVATIVE_TYPE n TMS
MS$DATA_PROCESSING: WHOLE GCMSsolution

PK$SPLASH: splash10-0fy9-3691100000-8e2aec35c6c7e60616e0
PK$NUM_PEAK: 350
PK$PEAK: m/z int. rel.int.
  86.000000 110.000000 16
  87.000000 38.000000 5
  88.000000 110.000000 16
  89.050000 6958.000000 999
  90.000000 849.000000 122
  91.000000 1049.000000 151
  92.000000 351.000000 50
  93.000000 234.000000 34
  94.000000 137.000000 20
  95.000000 252.000000 36
  96.000000 166.000000 24
  97.000000 206.000000 30
  98.000000 18.000000 3
  99.000000 129.000000 19
  100.000000 191.000000 27
  101.000000 138.000000 20
  102.000000 18.000000 3
  103.000000 202.000000 29
  104.000000 209.000000 30
  105.000000 172.000000 25
  106.000000 634.000000 91
  107.000000 409.000000 59
  108.000000 140.000000 20
  109.000000 292.000000 42
  110.000000 126.000000 18
  111.000000 150.000000 22
  112.000000 47.000000 7
  113.000000 124.000000 18
  114.000000 38.000000 5
  115.000000 86.000000 12
  116.000000 49.000000 7
  117.000000 118.000000 17
  118.000000 79.000000 11
  119.000000 158.000000 23
  120.000000 510.000000 73
  121.000000 716.000000 103
  122.000000 122.000000 18
  123.000000 79.000000 11
  124.000000 29.000000 4
  125.000000 223.000000 32
  126.000000 95.000000 14
  127.000000 108.000000 16
  128.000000 16.000000 2
  129.000000 36.000000 5
  130.000000 58.000000 8
  131.000000 334.000000 48
  132.000000 60.000000 9
  133.000000 135.000000 19
  134.000000 321.000000 46
  135.000000 370.000000 53
  136.000000 220.000000 32
  137.000000 246.000000 35
  138.000000 46.000000 7
  139.000000 95.000000 14
  141.000000 34.000000 5
  142.000000 97.000000 14
  143.000000 73.000000 10
  144.000000 122.000000 18
  146.000000 218.000000 31
  147.000000 191.000000 27
  148.000000 1058.000000 152
  149.000000 314.000000 45
  150.000000 234.000000 34
  151.000000 217.000000 31
  152.000000 106.000000 15
  153.000000 138.000000 20
  154.000000 41.000000 6
  155.000000 39.000000 6
  156.000000 86.000000 12
  158.000000 41.000000 6
  159.000000 5.000000 1
  160.000000 33.000000 5
  161.000000 66.000000 9
  162.000000 193.000000 28
  163.000000 903.000000 130
  164.000000 310.000000 45
  165.000000 1428.000000 205
  166.000000 361.000000 52
  167.000000 146.000000 21
  168.000000 79.000000 11
  169.000000 138.000000 20
  170.000000 74.000000 11
  171.000000 90.000000 13
  172.000000 47.000000 7
  173.000000 151.000000 22
  174.000000 98.000000 14
  176.000000 140.000000 20
  177.000000 242.000000 35
  178.000000 239.000000 34
  179.000000 615.000000 88
  180.000000 697.000000 100
  181.000000 652.000000 94
  182.000000 121.000000 17
  183.000000 13.000000 2
  184.000000 76.000000 11
  185.000000 78.000000 11
  187.000000 63.000000 9
  189.000000 19.000000 3
  190.000000 76.000000 11
  191.000000 476.000000 68
  192.000000 228.000000 33
  193.000000 609.000000 87
  194.000000 255.000000 37
  195.000000 1004.000000 144
  196.000000 316.000000 45
  197.000000 159.000000 23
  198.000000 62.000000 9
  199.000000 74.000000 11
  200.000000 24.000000 3
  202.000000 22.000000 3
  203.000000 60.000000 9
  204.000000 142.000000 20
  205.000000 247.000000 35
  205.950000 1972.000000 283
  207.000000 684.000000 98
  208.000000 278.000000 40
  209.000000 308.000000 44
  210.000000 5.000000 1
  211.000000 95.000000 14
  212.000000 63.000000 9
  213.000000 92.000000 13
  215.000000 36.000000 5
  216.000000 116.000000 17
  217.000000 50.000000 7
  219.000000 527.000000 76
  220.000000 273.000000 39
  221.000000 2503.000000 359
  222.000000 2364.000000 339
  223.000000 700.000000 101
  224.000000 185.000000 27
  225.000000 65.000000 9
  226.000000 10.000000 1
  227.000000 52.000000 7
  228.000000 105.000000 15
  229.000000 92.000000 13
  230.000000 31.000000 4
  233.000000 95.000000 14
  234.000000 94.000000 13
  235.000000 55.000000 8
  236.050000 1166.000000 167
  237.000000 260.000000 37
  238.000000 116.000000 17
  239.000000 52.000000 7
  240.000000 68.000000 10
  241.000000 87.000000 12
  242.000000 58.000000 8
  243.000000 55.000000 8
  244.000000 47.000000 7
  245.000000 47.000000 7
  246.000000 29.000000 4
  247.000000 36.000000 5
  248.000000 100.000000 14
  249.000000 16.000000 2
  250.000000 140.000000 20
  251.000000 62.000000 9
  252.000000 4751.000000 682
  253.000000 959.000000 138
  254.000000 156.000000 22
  255.000000 11.000000 2
  256.000000 74.000000 11
  257.000000 22.000000 3
  259.000000 5.000000 1
  261.000000 5.000000 1
  262.000000 98.000000 14
  263.000000 42.000000 6
  264.000000 94.000000 13
  265.000000 81.000000 12
  266.000000 135.000000 19
  267.050000 4158.000000 597
  268.100000 898.000000 129
  269.100000 148.000000 21
  270.100000 89.000000 13
  271.100000 122.000000 18
  273.100000 122.000000 18
  275.100000 29.000000 4
  276.100000 95.000000 14
  277.100000 89.000000 13
  278.100000 42.000000 6
  279.100000 34.000000 5
  280.100000 42.000000 6
  281.100000 102.000000 15
  282.100000 98.000000 14
  283.100000 108.000000 16
  284.100000 33.000000 5
  286.100000 34.000000 5
  287.100000 18.000000 3
  288.100000 57.000000 8
  289.100000 58.000000 8
  290.100000 39.000000 6
  292.100000 50.000000 7
  293.100000 55.000000 8
  295.100000 110.000000 16
  296.100000 84.000000 12
  298.100000 65.000000 9
  299.100000 27.000000 4
  300.100000 21.000000 3
  301.100000 5.000000 1
  302.100000 13.000000 2
  303.100000 36.000000 5
  305.100000 58.000000 8
  306.100000 57.000000 8
  308.100000 39.000000 6
  309.100000 39.000000 6
  310.100000 86.000000 12
  311.100000 42.000000 6
  312.100000 16.000000 2
  313.100000 65.000000 9
  314.100000 13.000000 2
  315.100000 60.000000 9
  316.100000 66.000000 9
  317.100000 21.000000 3
  318.100000 29.000000 4
  319.100000 58.000000 8
  320.100000 46.000000 7
  321.100000 90.000000 13
  324.100000 82.000000 12
  325.100000 26.000000 4
  326.100000 102.000000 15
  327.100000 26.000000 4
  328.100000 13.000000 2
  329.100000 81.000000 12
  330.100000 81.000000 12
  331.100000 124.000000 18
  332.100000 2.000000 1
  335.100000 124.000000 18
  336.100000 44.000000 6
  337.100000 60.000000 9
  340.100000 135.000000 19
  341.100000 98.000000 14
  342.100000 47.000000 7
  343.100000 47.000000 7
  344.100000 10.000000 1
  345.100000 2.000000 1
  346.100000 38.000000 5
  347.100000 10.000000 1
  349.100000 44.000000 6
  350.100000 57.000000 8
  351.100000 90.000000 13
  352.100000 18.000000 3
  353.100000 54.000000 8
  355.100000 70.000000 10
  356.100000 87.000000 12
  358.100000 13.000000 2
  361.100000 66.000000 9
  362.100000 111.000000 16
  363.100000 70.000000 10
  364.100000 29.000000 4
  365.100000 42.000000 6
  366.100000 18.000000 3
  368.100000 105.000000 15
  370.100000 42.000000 6
  371.100000 11.000000 2
  373.100000 49.000000 7
  375.100000 82.000000 12
  376.100000 52.000000 7
  377.100000 70.000000 10
  378.100000 11.000000 2
  380.100000 18.000000 3
  381.100000 33.000000 5
  382.100000 44.000000 6
  383.100000 54.000000 8
  385.100000 86.000000 12
  386.100000 46.000000 7
  387.100000 18.000000 3
  389.100000 113.000000 16
  390.100000 124.000000 18
  391.100000 30.000000 4
  392.100000 52.000000 7
  393.100000 8.000000 1
  394.100000 78.000000 11
  395.100000 90.000000 13
  396.100000 26.000000 4
  397.100000 65.000000 9
  398.100000 49.000000 7
  399.100000 2.000000 1
  400.100000 111.000000 16
  402.100000 11.000000 2
  403.100000 16.000000 2
  404.100000 95.000000 14
  405.100000 49.000000 7
  406.100000 161.000000 23
  410.100000 13.000000 2
  411.100000 68.000000 10
  412.100000 78.000000 11
  413.100000 84.000000 12
  414.100000 81.000000 12
  415.100000 39.000000 6
  416.100000 26.000000 4
  417.100000 126.000000 18
  418.100000 58.000000 8
  419.100000 103.000000 15
  420.100000 34.000000 5
  421.100000 113.000000 16
  423.100000 46.000000 7
  425.100000 82.000000 12
  427.100000 54.000000 8
  428.100000 60.000000 9
  429.100000 52.000000 7
  430.100000 98.000000 14
  431.100000 124.000000 18
  433.100000 14.000000 2
  434.100000 129.000000 19
  435.100000 39.000000 6
  436.100000 54.000000 8
  438.100000 71.000000 10
  439.100000 50.000000 7
  440.100000 21.000000 3
  442.100000 8.000000 1
  443.100000 60.000000 9
  445.100000 129.000000 19
  446.100000 121.000000 17
  447.100000 57.000000 8
  448.100000 62.000000 9
  450.100000 38.000000 5
  451.100000 42.000000 6
  454.100000 22.000000 3
  455.100000 126.000000 18
  456.100000 19.000000 3
  458.100000 39.000000 6
  459.100000 31.000000 4
  460.100000 89.000000 13
  461.100000 50.000000 7
  463.100000 30.000000 4
  464.100000 49.000000 7
  468.100000 29.000000 4
  469.100000 76.000000 11
  470.100000 79.000000 11
  471.100000 41.000000 6
  472.100000 52.000000 7
  473.100000 39.000000 6
  475.100000 30.000000 4
  479.100000 39.000000 6
  480.100000 3.000000 1
  481.100000 105.000000 15
  482.100000 22.000000 3
  483.100000 3.000000 1
  484.100000 27.000000 4
  485.100000 14.000000 2
  486.100000 3.000000 1
  487.100000 3.000000 1
  488.100000 30.000000 4
  490.100000 24.000000 3
  491.100000 119.000000 17
  492.100000 52.000000 7
  493.100000 33.000000 5
  495.100000 68.000000 10
  496.100000 76.000000 11
  497.100000 24.000000 3
  498.100000 79.000000 11
  499.100000 39.000000 6